{"text_format":"1","workbook":"xlsx","n_sheets":9,"sheets":["Menu","PERFIL","RESP","PESQ","RELAT","Dash","Dash (2)","Instruções","calc"],"not_rendered":{"charts":7,"images":10,"macros":1,"external_links":0,"defined_names":14,"comments":0,"pivot_tables":0},"unopened":[],"bounds":{"document_bytes":16777216,"sheet_cells":100000,"rows_first":2000,"rows_last":500,"rows_between":2000,"halvings":0,"cell_chars":16384,"cell_head_chars":4096},"cells_cut":0,"cells_raw":0,"read":"whole","date_system":"1900"}

{"sheet":"Menu","index":0,"n_rows":0,"n_cols":0,"rows_kept":0,"cut":false,"hidden":false,"merged":[]}

{"sheet":"PERFIL","index":1,"n_rows":115,"n_cols":8,"rows_kept":115,"cut":false,"hidden":false,"merged":[[12,1,13,1],[11,3,11,7],[12,3,13,3],[12,4,13,4],[12,5,13,5],[12,6,13,6],[12,7,13,7]]}
[]
[]
[]
[]
[]
[]
[]
[]
[]
[]
[]
[null,"Cadastro de Perfil\nInsira os perfis que melhor representa seus clientes.",null,"Cadastro de Clientes\nInsira as informações dos seus clientes"]
[null,"Perfil",null,"Cliente","Perfil do Cliente","Telefone","E-mail","Idade"]
[]
[null,"Perfil 1",null,"Cliente 1","Perfil 1","9999-9999","entrevistado1@123.com.br",35]
[null,"Perfil 2",null,"Cliente 2","Perfil 1","8888-8888","entrevistado2@123.com.br",28]
[null,"Perfil 3",null,"Cliente 3","Perfil 2","7777-7777","entrevistado3@123.com.br",22]
[null,"Perfil 4",null,"Cliente 4","Perfil 3","6666-6666","entrevistado4@123.com.br",29]
[null,"Perfil 5",null,"Cliente 5","Perfil 5","5555-5555","entrevistado5@123.com.br",32]
[null,"Perfil 6"]
[null,"Perfil 7"]
[null,"Perfil 8"]
[null,"Perfil 9"]
[null,"Perfil 10"]
[]
[]
[]
[]
[]
[]
[]
[]
[]
[]
[]
[]
[]
[]
[]
[]
[]
[]
[]
[]
[]
[]
[]
[]
[]
[]
[]
[]
[]
[]
[]
[]
[]
[]
[]
[]
[]
[]
[]
[]
[]
[]
[]
[]
[]
[]
[]
[]
[]
[]
[]
[]
[]
[]
[]
[]
[]
[]
[]
[]
[]
[]
[]
[]
[]
[]
[]
[]
[]
[]
[]
[]
[]
[]
[]
[]
[]
[]
[]
[]
[]
[]
[]
[]
[]
[]
[]
[]
[]
[]
[null,null,null,{"$f":"COUNTA(D15:D114)","v":5}]

{"sheet":"RESP","index":2,"n_rows":65,"n_cols":7,"rows_kept":65,"cut":false,"hidden":false,"merged":[[12,1,13,1],[12,2,13,2],[12,3,13,3],[11,1,11,3],[11,5,11,6],[12,5,13,5],[12,6,13,6]]}
[]
[]
[]
[]
[]
[]
[]
[]
[]
[]
[]
[null,"Tipo de Resposta\nInsira as configurações do tipo de resposta.",null,null,null,"Cadastro de Perguntas\nInsira as perguntas relevantes para seus clientes"]
[null,"Binária","Avaliação","Qualitativa",null,"Pergunta","Tipo de Resposta"]
[]
[null,"Sim","Excelente",1,null,"Você indicaria nossos produtos?","Binária"]
[null,"Não","Bom",2,null,"Qual sua avaliação em relação ao prazo de entrega dos produtos?","Avaliação"]
[null,null,"Ruim",3,null,"Qual sua nota referente ao nosso atendimento telefônico?","Qualitativa"]
[null,null,"Péssimo",4,null,"O Produto atendeu as suas expectativas?","Binária"]
[null,null,null,5]
[null,null,null,6]
[null,null,null,7]
[null,null,null,8]
[null,null,null,9]
[null,null,null,10]
[]
[]
[]
[]
[]
[]
[]
[]
[]
[]
[]
[]
[]
[]
[]
[]
[]
[]
[]
[]
[]
[]
[]
[]
[]
[]
[]
[]
[]
[]
[]
[]
[]
[]
[]
[]
[]
[]
[]
[]
[null,null,null,null,null,{"$f":"COUNTA(pergunta)","v":4}]

{"sheet":"PESQ","index":3,"n_rows":139,"n_cols":52,"rows_kept":139,"cut":false,"hidden":false,"merged":[[11,50,12,50],[11,51,12,51],[11,45,12,45],[11,46,12,46],[11,47,12,47],[11,48,12,48],[11,49,12,49],[11,40,12,40],[11,41,12,41],[11,42,12,42],[11,43,12,43],[11,44,12,44],[11,35,12,35],[11,36,12,36],[11,37,12,37],[11,38,12,38],[11,39,12,39],[11,30,12,30],[11,31,12,31],[11,32,12,32],[11,33,12,33],[11,34,12,34],[11,25,12,25],[11,26,12,26],[11,27,12,27],[11,28,12,28],[11,29,12,29],[11,20,12,20],[11,21,12,21],[11,22,12,22],[11,23,12,23],[11,24,12,24],[11,15,12,15],[11,16,12,16],[11,17,12,17],[11,18,12,18],[11,19,12,19],[11,10,12,10],[11,11,12,11],[11,12,12,12],[11,13,12,13],[11,14,12,14],[11,5,12,5],[11,6,12,6],[11,7,12,7],[11,8,12,8],[11,9,12,9],[10,1,10,2],[11,1,12,1],[11,2,12,2],[11,3,12,3],[11,4,12,4]]}
[]
[]
[]
[]
[]
[]
[]
[]
[]
[]
[null,"Pesquisa de Satisfação de Clientes\nInsira as respostas para cada cliente."]
[null,"Cliente",{"$f":"RESP!$F$15","v":"Você indicaria nossos produtos?"},{"$f":"RESP!$F$16","v":"Qual sua avaliação em relação ao prazo de entrega dos produtos?"},{"$f":"RESP!$F$17","v":"Qual sua nota referente ao nosso atendimento telefônico?"},{"$f":"RESP!$F$18","v":"O Produto atendeu as suas expectativas?"},{"$f":"RESP!$F$19","v":0},{"$f":"RESP!$F$20","v":0},{"$f":"RESP!$F$21","v":0},{"$f":"RESP!$F$22","v":0},{"$f":"RESP!$F$23","v":0},{"$f":"RESP!$F$24","v":0},{"$f":"RESP!$F$25","v":0},{"$f":"RESP!$F$26","v":0},{"$f":"RESP!$F$27","v":0},{"$f":"RESP!$F$28","v":0},{"$f":"RESP!$F$29","v":0},{"$f":"RESP!$F$30","v":0},{"$f":"RESP!$F$31","v":0},{"$f":"RESP!$F$32","v":0},{"$f":"RESP!$F$33","v":0},{"$f":"RESP!$F$34","v":0},{"$f":"RESP!$F$35","v":0},{"$f":"RESP!$F$36","v":0},{"$f":"RESP!$F$37","v":0},{"$f":"RESP!$F$38","v":0},{"$f":"RESP!$F$39","v":0},{"$f":"RESP!$F$40","v":0},{"$f":"RESP!$F$41","v":0},{"$f":"RESP!$F$42","v":0},{"$f":"RESP!$F$43","v":0},{"$f":"RESP!$F$44","v":0},{"$f":"RESP!$F$45","v":0},{"$f":"RESP!$F$46","v":0},{"$f":"RESP!$F$47","v":0},{"$f":"RESP!$F$48","v":0},{"$f":"RESP!$F$49","v":0},{"$f":"RESP!$F$50","v":0},{"$f":"RESP!$F$51","v":0},{"$f":"RESP!$F$52","v":0},{"$f":"RESP!$F$53","v":0},{"$f":"RESP!$F$54","v":0},{"$f":"RESP!$F$55","v":0},{"$f":"RESP!$F$56","v":0},{"$f":"RESP!$F$57","v":0},{"$f":"RESP!$F$58","v":0},{"$f":"RESP!$F$59","v":0},{"$f":"RESP!$F$60","v":0},{"$f":"RESP!$F$61","v":0},{"$f":"RESP!$F$62","v":0},{"$f":"RESP!$F$63","v":0},{"$f":"RESP!$F$64","v":0}]
[]
[null,{"$f":"IF(PERFIL!D15=\"\",\"\",PERFIL!D15)","v":"Cliente 1"},"Sim","Excelente",2]
[null,{"$f":"IF(PERFIL!D16=\"\",\"\",PERFIL!D16)","v":"Cliente 2"},"Não","Bom",4]
[null,{"$f":"IF(PERFIL!D17=\"\",\"\",PERFIL!D17)","v":"Cliente 3"},"Sim","Ruim",5]
[null,{"$f":"IF(PERFIL!D18=\"\",\"\",PERFIL!D18)","v":"Cliente 4"},"Não","Péssimo",2]
[null,{"$f":"IF(PERFIL!D19=\"\",\"\",PERFIL!D19)","v":"Cliente 5"},"Sim","Excelente",10]
[null,{"$f":"IF(PERFIL!D20=\"\",\"\",PERFIL!D20)","v":""}]
[null,{"$f":"IF(PERFIL!D21=\"\",\"\",PERFIL!D21)","v":""}]
[null,{"$f":"IF(PERFIL!D22=\"\",\"\",PERFIL!D22)","v":""}]
[null,{"$f":"IF(PERFIL!D23=\"\",\"\",PERFIL!D23)","v":""}]
[null,{"$f":"IF(PERFIL!D24=\"\",\"\",PERFIL!D24)","v":""}]
[null,{"$f":"IF(PERFIL!D25=\"\",\"\",PERFIL!D25)","v":""}]
[null,{"$f":"IF(PERFIL!D26=\"\",\"\",PERFIL!D26)","v":""}]
[null,{"$f":"IF(PERFIL!D27=\"\",\"\",PERFIL!D27)","v":""}]
[null,{"$f":"IF(PERFIL!D28=\"\",\"\",PERFIL!D28)","v":""}]
[null,{"$f":"IF(PERFIL!D29=\"\",\"\",PERFIL!D29)","v":""}]
[null,{"$f":"IF(PERFIL!D30=\"\",\"\",PERFIL!D30)","v":""}]
[null,{"$f":"IF(PERFIL!D31=\"\",\"\",PERFIL!D31)","v":""}]
[null,{"$f":"IF(PERFIL!D32=\"\",\"\",PERFIL!D32)","v":""}]
[null,{"$f":"IF(PERFIL!D33=\"\",\"\",PERFIL!D33)","v":""}]
[null,{"$f":"IF(PERFIL!D34=\"\",\"\",PERFIL!D34)","v":""}]
[null,{"$f":"IF(PERFIL!D35=\"\",\"\",PERFIL!D35)","v":""}]
[null,{"$f":"IF(PERFIL!D36=\"\",\"\",PERFIL!D36)","v":""}]
[null,{"$f":"IF(PERFIL!D37=\"\",\"\",PERFIL!D37)","v":""}]
[null,{"$f":"IF(PERFIL!D38=\"\",\"\",PERFIL!D38)","v":""}]
[null,{"$f":"IF(PERFIL!D39=\"\",\"\",PERFIL!D39)","v":""}]
[null,{"$f":"IF(PERFIL!D40=\"\",\"\",PERFIL!D40)","v":""}]
[null,{"$f":"IF(PERFIL!D41=\"\",\"\",PERFIL!D41)","v":""}]
[null,{"$f":"IF(PERFIL!D42=\"\",\"\",PERFIL!D42)","v":""}]
[null,{"$f":"IF(PERFIL!D43=\"\",\"\",PERFIL!D43)","v":""}]
[null,{"$f":"IF(PERFIL!D44=\"\",\"\",PERFIL!D44)","v":""}]
[null,{"$f":"IF(PERFIL!D45=\"\",\"\",PERFIL!D45)","v":""}]
[null,{"$f":"IF(PERFIL!D46=\"\",\"\",PERFIL!D46)","v":""}]
[null,{"$f":"IF(PERFIL!D47=\"\",\"\",PERFIL!D47)","v":""}]
[null,{"$f":"IF(PERFIL!D48=\"\",\"\",PERFIL!D48)","v":""}]
[null,{"$f":"IF(PERFIL!D49=\"\",\"\",PERFIL!D49)","v":""}]
[null,{"$f":"IF(PERFIL!D50=\"\",\"\",PERFIL!D50)","v":""}]
[null,{"$f":"IF(PERFIL!D51=\"\",\"\",PERFIL!D51)","v":""}]
[null,{"$f":"IF(PERFIL!D52=\"\",\"\",PERFIL!D52)","v":""}]
[null,{"$f":"IF(PERFIL!D53=\"\",\"\",PERFIL!D53)","v":""}]
[null,{"$f":"IF(PERFIL!D54=\"\",\"\",PERFIL!D54)","v":""}]
[null,{"$f":"IF(PERFIL!D55=\"\",\"\",PERFIL!D55)","v":""}]
[null,{"$f":"IF(PERFIL!D56=\"\",\"\",PERFIL!D56)","v":""}]
[null,{"$f":"IF(PERFIL!D57=\"\",\"\",PERFIL!D57)","v":""}]
[null,{"$f":"IF(PERFIL!D58=\"\",\"\",PERFIL!D58)","v":""}]
[null,{"$f":"IF(PERFIL!D59=\"\",\"\",PERFIL!D59)","v":""}]
[null,{"$f":"IF(PERFIL!D60=\"\",\"\",PERFIL!D60)","v":""}]
[null,{"$f":"IF(PERFIL!D61=\"\",\"\",PERFIL!D61)","v":""}]
[null,{"$f":"IF(PERFIL!D62=\"\",\"\",PERFIL!D62)","v":""}]
[null,{"$f":"IF(PERFIL!D63=\"\",\"\",PERFIL!D63)","v":""}]
[null,{"$f":"IF(PERFIL!D64=\"\",\"\",PERFIL!D64)","v":""}]
[null,{"$f":"IF(PERFIL!D65=\"\",\"\",PERFIL!D65)","v":""}]
[null,{"$f":"IF(PERFIL!D66=\"\",\"\",PERFIL!D66)","v":""}]
[null,{"$f":"IF(PERFIL!D67=\"\",\"\",PERFIL!D67)","v":""}]
[null,{"$f":"IF(PERFIL!D68=\"\",\"\",PERFIL!D68)","v":""}]
[null,{"$f":"IF(PERFIL!D69=\"\",\"\",PERFIL!D69)","v":""}]
[null,{"$f":"IF(PERFIL!D70=\"\",\"\",PERFIL!D70)","v":""}]
[null,{"$f":"IF(PERFIL!D71=\"\",\"\",PERFIL!D71)","v":""}]
[null,{"$f":"IF(PERFIL!D72=\"\",\"\",PERFIL!D72)","v":""}]
[null,{"$f":"IF(PERFIL!D73=\"\",\"\",PERFIL!D73)","v":""}]
[null,{"$f":"IF(PERFIL!D74=\"\",\"\",PERFIL!D74)","v":""}]
[null,{"$f":"IF(PERFIL!D75=\"\",\"\",PERFIL!D75)","v":""}]
[null,{"$f":"IF(PERFIL!D76=\"\",\"\",PERFIL!D76)","v":""}]
[null,{"$f":"IF(PERFIL!D77=\"\",\"\",PERFIL!D77)","v":""}]
[null,{"$f":"IF(PERFIL!D78=\"\",\"\",PERFIL!D78)","v":""}]
[null,{"$f":"IF(PERFIL!D79=\"\",\"\",PERFIL!D79)","v":""}]
[null,{"$f":"IF(PERFIL!D80=\"\",\"\",PERFIL!D80)","v":""}]
[null,{"$f":"IF(PERFIL!D81=\"\",\"\",PERFIL!D81)","v":""}]
[null,{"$f":"IF(PERFIL!D82=\"\",\"\",PERFIL!D82)","v":""}]
[null,{"$f":"IF(PERFIL!D83=\"\",\"\",PERFIL!D83)","v":""}]
[null,{"$f":"IF(PERFIL!D84=\"\",\"\",PERFIL!D84)","v":""}]
[null,{"$f":"IF(PERFIL!D85=\"\",\"\",PERFIL!D85)","v":""}]
[null,{"$f":"IF(PERFIL!D86=\"\",\"\",PERFIL!D86)","v":""}]
[null,{"$f":"IF(PERFIL!D87=\"\",\"\",PERFIL!D87)","v":""}]
[null,{"$f":"IF(PERFIL!D88=\"\",\"\",PERFIL!D88)","v":""}]
[null,{"$f":"IF(PERFIL!D89=\"\",\"\",PERFIL!D89)","v":""}]
[null,{"$f":"IF(PERFIL!D90=\"\",\"\",PERFIL!D90)","v":""}]
[null,{"$f":"IF(PERFIL!D91=\"\",\"\",PERFIL!D91)","v":""}]
[null,{"$f":"IF(PERFIL!D92=\"\",\"\",PERFIL!D92)","v":""}]
[null,{"$f":"IF(PERFIL!D93=\"\",\"\",PERFIL!D93)","v":""}]
[null,{"$f":"IF(PERFIL!D94=\"\",\"\",PERFIL!D94)","v":""}]
[null,{"$f":"IF(PERFIL!D95=\"\",\"\",PERFIL!D95)","v":""}]
[null,{"$f":"IF(PERFIL!D96=\"\",\"\",PERFIL!D96)","v":""}]
[null,{"$f":"IF(PERFIL!D97=\"\",\"\",PERFIL!D97)","v":""}]
[null,{"$f":"IF(PERFIL!D98=\"\",\"\",PERFIL!D98)","v":""}]
[null,{"$f":"IF(PERFIL!D99=\"\",\"\",PERFIL!D99)","v":""}]
[null,{"$f":"IF(PERFIL!D100=\"\",\"\",PERFIL!D100)","v":""}]
[null,{"$f":"IF(PERFIL!D101=\"\",\"\",PERFIL!D101)","v":""}]
[null,{"$f":"IF(PERFIL!D102=\"\",\"\",PERFIL!D102)","v":""}]
[null,{"$f":"IF(PERFIL!D103=\"\",\"\",PERFIL!D103)","v":""}]
[null,{"$f":"IF(PERFIL!D104=\"\",\"\",PERFIL!D104)","v":""}]
[null,{"$f":"IF(PERFIL!D105=\"\",\"\",PERFIL!D105)","v":""}]
[null,{"$f":"IF(PERFIL!D106=\"\",\"\",PERFIL!D106)","v":""}]
[null,{"$f":"IF(PERFIL!D107=\"\",\"\",PERFIL!D107)","v":""}]
[null,{"$f":"IF(PERFIL!D108=\"\",\"\",PERFIL!D108)","v":""}]
[null,{"$f":"IF(PERFIL!D109=\"\",\"\",PERFIL!D109)","v":""}]
[null,{"$f":"IF(PERFIL!D110=\"\",\"\",PERFIL!D110)","v":""}]
[null,{"$f":"IF(PERFIL!D111=\"\",\"\",PERFIL!D111)","v":""}]
[null,{"$f":"IF(PERFIL!D112=\"\",\"\",PERFIL!D112)","v":""}]
[null,{"$f":"IF(PERFIL!D113=\"\",\"\",PERFIL!D113)","v":""}]
[]
[null,{"$f":"IF(PERFIL!D114=\"\",\"\",PERFIL!D114)","v":""}]
[null,null,{"$f":"IFERROR(IF(VLOOKUP(C$12,RESP!$F$15:$G$64,2,0)=\"Binária\",\"bin\",IF(VLOOKUP(C$12,RESP!$F$15:$G$64,2,0)=\"Avaliação\",\"avaliacao\",IF(VLOOKUP(C$12,RESP!$F$15:$G$64,2,0)=\"Qualitativa\",\"qualit\",\"\"))),\"\")","v":"bin"},{"$f":"IFERROR(IF(VLOOKUP(D$12,RESP!$F$15:$G$64,2,0)=\"Binária\",\"bin\",IF(VLOOKUP(D$12,RESP!$F$15:$G$64,2,0)=\"Avaliação\",\"avaliacao\",IF(VLOOKUP(D$12,RESP!$F$15:$G$64,2,0)=\"Qualitativa\",\"qualit\",\"\"))),\"\")","v":"avaliacao"},{"$f":"IFERROR(IF(VLOOKUP(E$12,RESP!$F$15:$G$64,2,0)=\"Binária\",\"bin\",IF(VLOOKUP(E$12,RESP!$F$15:$G$64,2,0)=\"Avaliação\",\"avaliacao\",IF(VLOOKUP(E$12,RESP!$F$15:$G$64,2,0)=\"Qualitativa\",\"qualit\",\"\"))),\"\")","v":"qualit"},{"$f":"IFERROR(IF(VLOOKUP(F$12,RESP!$F$15:$G$64,2,0)=\"Binária\",\"bin\",IF(VLOOKUP(F$12,RESP!$F$15:$G$64,2,0)=\"Avaliação\",\"avaliacao\",IF(VLOOKUP(F$12,RESP!$F$15:$G$64,2,0)=\"Qualitativa\",\"qualit\",\"\"))),\"\")","v":"bin"},{"$f":"IFERROR(IF(VLOOKUP(G$12,RESP!$F$15:$G$64,2,0)=\"Binária\",\"bin\",IF(VLOOKUP(G$12,RESP!$F$15:$G$64,2,0)=\"Avaliação\",\"avaliacao\",IF(VLOOKUP(G$12,RESP!$F$15:$G$64,2,0)=\"Qualitativa\",\"qualit\",\"\"))),\"\")","v":""},{"$f":"IFERROR(IF(VLOOKUP(H$12,RESP!$F$15:$G$64,2,0)=\"Binária\",\"bin\",IF(VLOOKUP(H$12,RESP!$F$15:$G$64,2,0)=\"Avaliação\",\"avaliacao\",IF(VLOOKUP(H$12,RESP!$F$15:$G$64,2,0)=\"Qualitativa\",\"qualit\",\"\"))),\"\")","v":""},{"$f":"IFERROR(IF(VLOOKUP(I$12,RESP!$F$15:$G$64,2,0)=\"Binária\",\"bin\",IF(VLOOKUP(I$12,RESP!$F$15:$G$64,2,0)=\"Avaliação\",\"avaliacao\",IF(VLOOKUP(I$12,RESP!$F$15:$G$64,2,0)=\"Qualitativa\",\"qualit\",\"\"))),\"\")","v":""},{"$f":"IFERROR(IF(VLOOKUP(J$12,RESP!$F$15:$G$64,2,0)=\"Binária\",\"bin\",IF(VLOOKUP(J$12,RESP!$F$15:$G$64,2,0)=\"Avaliação\",\"avaliacao\",IF(VLOOKUP(J$12,RESP!$F$15:$G$64,2,0)=\"Qualitativa\",\"qualit\",\"\"))),\"\")","v":""},{"$f":"IFERROR(IF(VLOOKUP(K$12,RESP!$F$15:$G$64,2,0)=\"Binária\",\"bin\",IF(VLOOKUP(K$12,RESP!$F$15:$G$64,2,0)=\"Avaliação\",\"avaliacao\",IF(VLOOKUP(K$12,RESP!$F$15:$G$64,2,0)=\"Qualitativa\",\"qualit\",\"\"))),\"\")","v":""},{"$f":"IFERROR(IF(VLOOKUP(L$12,RESP!$F$15:$G$64,2,0)=\"Binária\",\"bin\",IF(VLOOKUP(L$12,RESP!$F$15:$G$64,2,0)=\"Avaliação\",\"avaliacao\",IF(VLOOKUP(L$12,RESP!$F$15:$G$64,2,0)=\"Qualitativa\",\"qualit\",\"\"))),\"\")","v":""},{"$f":"IFERROR(IF(VLOOKUP(M$12,RESP!$F$15:$G$64,2,0)=\"Binária\",\"bin\",IF(VLOOKUP(M$12,RESP!$F$15:$G$64,2,0)=\"Avaliação\",\"avaliacao\",IF(VLOOKUP(M$12,RESP!$F$15:$G$64,2,0)=\"Qualitativa\",\"qualit\",\"\"))),\"\")","v":""},{"$f":"IFERROR(IF(VLOOKUP(N$12,RESP!$F$15:$G$64,2,0)=\"Binária\",\"bin\",IF(VLOOKUP(N$12,RESP!$F$15:$G$64,2,0)=\"Avaliação\",\"avaliacao\",IF(VLOOKUP(N$12,RESP!$F$15:$G$64,2,0)=\"Qualitativa\",\"qualit\",\"\"))),\"\")","v":""},{"$f":"IFERROR(IF(VLOOKUP(O$12,RESP!$F$15:$G$64,2,0)=\"Binária\",\"bin\",IF(VLOOKUP(O$12,RESP!$F$15:$G$64,2,0)=\"Avaliação\",\"avaliacao\",IF(VLOOKUP(O$12,RESP!$F$15:$G$64,2,0)=\"Qualitativa\",\"qualit\",\"\"))),\"\")","v":""},{"$f":"IFERROR(IF(VLOOKUP(P$12,RESP!$F$15:$G$64,2,0)=\"Binária\",\"bin\",IF(VLOOKUP(P$12,RESP!$F$15:$G$64,2,0)=\"Avaliação\",\"avaliacao\",IF(VLOOKUP(P$12,RESP!$F$15:$G$64,2,0)=\"Qualitativa\",\"qualit\",\"\"))),\"\")","v":""},{"$f":"IFERROR(IF(VLOOKUP(Q$12,RESP!$F$15:$G$64,2,0)=\"Binária\",\"bin\",IF(VLOOKUP(Q$12,RESP!$F$15:$G$64,2,0)=\"Avaliação\",\"avaliacao\",IF(VLOOKUP(Q$12,RESP!$F$15:$G$64,2,0)=\"Qualitativa\",\"qualit\",\"\"))),\"\")","v":""},{"$f":"IFERROR(IF(VLOOKUP(R$12,RESP!$F$15:$G$64,2,0)=\"Binária\",\"bin\",IF(VLOOKUP(R$12,RESP!$F$15:$G$64,2,0)=\"Avaliação\",\"avaliacao\",IF(VLOOKUP(R$12,RESP!$F$15:$G$64,2,0)=\"Qualitativa\",\"qualit\",\"\"))),\"\")","v":""},{"$f":"IFERROR(IF(VLOOKUP(S$12,RESP!$F$15:$G$64,2,0)=\"Binária\",\"bin\",IF(VLOOKUP(S$12,RESP!$F$15:$G$64,2,0)=\"Avaliação\",\"avaliacao\",IF(VLOOKUP(S$12,RESP!$F$15:$G$64,2,0)=\"Qualitativa\",\"qualit\",\"\"))),\"\")","v":""},{"$f":"IFERROR(IF(VLOOKUP(T$12,RESP!$F$15:$G$64,2,0)=\"Binária\",\"bin\",IF(VLOOKUP(T$12,RESP!$F$15:$G$64,2,0)=\"Avaliação\",\"avaliacao\",IF(VLOOKUP(T$12,RESP!$F$15:$G$64,2,0)=\"Qualitativa\",\"qualit\",\"\"))),\"\")","v":""},{"$f":"IFERROR(IF(VLOOKUP(U$12,RESP!$F$15:$G$64,2,0)=\"Binária\",\"bin\",IF(VLOOKUP(U$12,RESP!$F$15:$G$64,2,0)=\"Avaliação\",\"avaliacao\",IF(VLOOKUP(U$12,RESP!$F$15:$G$64,2,0)=\"Qualitativa\",\"qualit\",\"\"))),\"\")","v":""},{"$f":"IFERROR(IF(VLOOKUP(V$12,RESP!$F$15:$G$64,2,0)=\"Binária\",\"bin\",IF(VLOOKUP(V$12,RESP!$F$15:$G$64,2,0)=\"Avaliação\",\"avaliacao\",IF(VLOOKUP(V$12,RESP!$F$15:$G$64,2,0)=\"Qualitativa\",\"qualit\",\"\"))),\"\")","v":""},{"$f":"IFERROR(IF(VLOOKUP(W$12,RESP!$F$15:$G$64,2,0)=\"Binária\",\"bin\",IF(VLOOKUP(W$12,RESP!$F$15:$G$64,2,0)=\"Avaliação\",\"avaliacao\",IF(VLOOKUP(W$12,RESP!$F$15:$G$64,2,0)=\"Qualitativa\",\"qualit\",\"\"))),\"\")","v":""},{"$f":"IFERROR(IF(VLOOKUP(X$12,RESP!$F$15:$G$64,2,0)=\"Binária\",\"bin\",IF(VLOOKUP(X$12,RESP!$F$15:$G$64,2,0)=\"Avaliação\",\"avaliacao\",IF(VLOOKUP(X$12,RESP!$F$15:$G$64,2,0)=\"Qualitativa\",\"qualit\",\"\"))),\"\")","v":""},{"$f":"IFERROR(IF(VLOOKUP(Y$12,RESP!$F$15:$G$64,2,0)=\"Binária\",\"bin\",IF(VLOOKUP(Y$12,RESP!$F$15:$G$64,2,0)=\"Avaliação\",\"avaliacao\",IF(VLOOKUP(Y$12,RESP!$F$15:$G$64,2,0)=\"Qualitativa\",\"qualit\",\"\"))),\"\")","v":""},{"$f":"IFERROR(IF(VLOOKUP(Z$12,RESP!$F$15:$G$64,2,0)=\"Binária\",\"bin\",IF(VLOOKUP(Z$12,RESP!$F$15:$G$64,2,0)=\"Avaliação\",\"avaliacao\",IF(VLOOKUP(Z$12,RESP!$F$15:$G$64,2,0)=\"Qualitativa\",\"qualit\",\"\"))),\"\")","v":""},{"$f":"IFERROR(IF(VLOOKUP(AA$12,RESP!$F$15:$G$64,2,0)=\"Binária\",\"bin\",IF(VLOOKUP(AA$12,RESP!$F$15:$G$64,2,0)=\"Avaliação\",\"avaliacao\",IF(VLOOKUP(AA$12,RESP!$F$15:$G$64,2,0)=\"Qualitativa\",\"qualit\",\"\"))),\"\")","v":""},{"$f":"IFERROR(IF(VLOOKUP(AB$12,RESP!$F$15:$G$64,2,0)=\"Binária\",\"bin\",IF(VLOOKUP(AB$12,RESP!$F$15:$G$64,2,0)=\"Avaliação\",\"avaliacao\",IF(VLOOKUP(AB$12,RESP!$F$15:$G$64,2,0)=\"Qualitativa\",\"qualit\",\"\"))),\"\")","v":""},{"$f":"IFERROR(IF(VLOOKUP(AC$12,RESP!$F$15:$G$64,2,0)=\"Binária\",\"bin\",IF(VLOOKUP(AC$12,RESP!$F$15:$G$64,2,0)=\"Avaliação\",\"avaliacao\",IF(VLOOKUP(AC$12,RESP!$F$15:$G$64,2,0)=\"Qualitativa\",\"qualit\",\"\"))),\"\")","v":""},{"$f":"IFERROR(IF(VLOOKUP(AD$12,RESP!$F$15:$G$64,2,0)=\"Binária\",\"bin\",IF(VLOOKUP(AD$12,RESP!$F$15:$G$64,2,0)=\"Avaliação\",\"avaliacao\",IF(VLOOKUP(AD$12,RESP!$F$15:$G$64,2,0)=\"Qualitativa\",\"qualit\",\"\"))),\"\")","v":""},{"$f":"IFERROR(IF(VLOOKUP(AE$12,RESP!$F$15:$G$64,2,0)=\"Binária\",\"bin\",IF(VLOOKUP(AE$12,RESP!$F$15:$G$64,2,0)=\"Avaliação\",\"avaliacao\",IF(VLOOKUP(AE$12,RESP!$F$15:$G$64,2,0)=\"Qualitativa\",\"qualit\",\"\"))),\"\")","v":""},{"$f":"IFERROR(IF(VLOOKUP(AF$12,RESP!$F$15:$G$64,2,0)=\"Binária\",\"bin\",IF(VLOOKUP(AF$12,RESP!$F$15:$G$64,2,0)=\"Avaliação\",\"avaliacao\",IF(VLOOKUP(AF$12,RESP!$F$15:$G$64,2,0)=\"Qualitativa\",\"qualit\",\"\"))),\"\")","v":""},{"$f":"IFERROR(IF(VLOOKUP(AG$12,RESP!$F$15:$G$64,2,0)=\"Binária\",\"bin\",IF(VLOOKUP(AG$12,RESP!$F$15:$G$64,2,0)=\"Avaliação\",\"avaliacao\",IF(VLOOKUP(AG$12,RESP!$F$15:$G$64,2,0)=\"Qualitativa\",\"qualit\",\"\"))),\"\")","v":""},{"$f":"IFERROR(IF(VLOOKUP(AH$12,RESP!$F$15:$G$64,2,0)=\"Binária\",\"bin\",IF(VLOOKUP(AH$12,RESP!$F$15:$G$64,2,0)=\"Avaliação\",\"avaliacao\",IF(VLOOKUP(AH$12,RESP!$F$15:$G$64,2,0)=\"Qualitativa\",\"qualit\",\"\"))),\"\")","v":""},{"$f":"IFERROR(IF(VLOOKUP(AI$12,RESP!$F$15:$G$64,2,0)=\"Binária\",\"bin\",IF(VLOOKUP(AI$12,RESP!$F$15:$G$64,2,0)=\"Avaliação\",\"avaliacao\",IF(VLOOKUP(AI$12,RESP!$F$15:$G$64,2,0)=\"Qualitativa\",\"qualit\",\"\"))),\"\")","v":""},{"$f":"IFERROR(IF(VLOOKUP(AJ$12,RESP!$F$15:$G$64,2,0)=\"Binária\",\"bin\",IF(VLOOKUP(AJ$12,RESP!$F$15:$G$64,2,0)=\"Avaliação\",\"avaliacao\",IF(VLOOKUP(AJ$12,RESP!$F$15:$G$64,2,0)=\"Qualitativa\",\"qualit\",\"\"))),\"\")","v":""},{"$f":"IFERROR(IF(VLOOKUP(AK$12,RESP!$F$15:$G$64,2,0)=\"Binária\",\"bin\",IF(VLOOKUP(AK$12,RESP!$F$15:$G$64,2,0)=\"Avaliação\",\"avaliacao\",IF(VLOOKUP(AK$12,RESP!$F$15:$G$64,2,0)=\"Qualitativa\",\"qualit\",\"\"))),\"\")","v":""},{"$f":"IFERROR(IF(VLOOKUP(AL$12,RESP!$F$15:$G$64,2,0)=\"Binária\",\"bin\",IF(VLOOKUP(AL$12,RESP!$F$15:$G$64,2,0)=\"Avaliação\",\"avaliacao\",IF(VLOOKUP(AL$12,RESP!$F$15:$G$64,2,0)=\"Qualitativa\",\"qualit\",\"\"))),\"\")","v":""},{"$f":"IFERROR(IF(VLOOKUP(AM$12,RESP!$F$15:$G$64,2,0)=\"Binária\",\"bin\",IF(VLOOKUP(AM$12,RESP!$F$15:$G$64,2,0)=\"Avaliação\",\"avaliacao\",IF(VLOOKUP(AM$12,RESP!$F$15:$G$64,2,0)=\"Qualitativa\",\"qualit\",\"\"))),\"\")","v":""},{"$f":"IFERROR(IF(VLOOKUP(AN$12,RESP!$F$15:$G$64,2,0)=\"Binária\",\"bin\",IF(VLOOKUP(AN$12,RESP!$F$15:$G$64,2,0)=\"Avaliação\",\"avaliacao\",IF(VLOOKUP(AN$12,RESP!$F$15:$G$64,2,0)=\"Qualitativa\",\"qualit\",\"\"))),\"\")","v":""},{"$f":"IFERROR(IF(VLOOKUP(AO$12,RESP!$F$15:$G$64,2,0)=\"Binária\",\"bin\",IF(VLOOKUP(AO$12,RESP!$F$15:$G$64,2,0)=\"Avaliação\",\"avaliacao\",IF(VLOOKUP(AO$12,RESP!$F$15:$G$64,2,0)=\"Qualitativa\",\"qualit\",\"\"))),\"\")","v":""},{"$f":"IFERROR(IF(VLOOKUP(AP$12,RESP!$F$15:$G$64,2,0)=\"Binária\",\"bin\",IF(VLOOKUP(AP$12,RESP!$F$15:$G$64,2,0)=\"Avaliação\",\"avaliacao\",IF(VLOOKUP(AP$12,RESP!$F$15:$G$64,2,0)=\"Qualitativa\",\"qualit\",\"\"))),\"\")","v":""},{"$f":"IFERROR(IF(VLOOKUP(AQ$12,RESP!$F$15:$G$64,2,0)=\"Binária\",\"bin\",IF(VLOOKUP(AQ$12,RESP!$F$15:$G$64,2,0)=\"Avaliação\",\"avaliacao\",IF(VLOOKUP(AQ$12,RESP!$F$15:$G$64,2,0)=\"Qualitativa\",\"qualit\",\"\"))),\"\")","v":""},{"$f":"IFERROR(IF(VLOOKUP(AR$12,RESP!$F$15:$G$64,2,0)=\"Binária\",\"bin\",IF(VLOOKUP(AR$12,RESP!$F$15:$G$64,2,0)=\"Avaliação\",\"avaliacao\",IF(VLOOKUP(AR$12,RESP!$F$15:$G$64,2,0)=\"Qualitativa\",\"qualit\",\"\"))),\"\")","v":""},{"$f":"IFERROR(IF(VLOOKUP(AS$12,RESP!$F$15:$G$64,2,0)=\"Binária\",\"bin\",IF(VLOOKUP(AS$12,RESP!$F$15:$G$64,2,0)=\"Avaliação\",\"avaliacao\",IF(VLOOKUP(AS$12,RESP!$F$15:$G$64,2,0)=\"Qualitativa\",\"qualit\",\"\"))),\"\")","v":""},{"$f":"IFERROR(IF(VLOOKUP(AT$12,RESP!$F$15:$G$64,2,0)=\"Binária\",\"bin\",IF(VLOOKUP(AT$12,RESP!$F$15:$G$64,2,0)=\"Avaliação\",\"avaliacao\",IF(VLOOKUP(AT$12,RESP!$F$15:$G$64,2,0)=\"Qualitativa\",\"qualit\",\"\"))),\"\")","v":""},{"$f":"IFERROR(IF(VLOOKUP(AU$12,RESP!$F$15:$G$64,2,0)=\"Binária\",\"bin\",IF(VLOOKUP(AU$12,RESP!$F$15:$G$64,2,0)=\"Avaliação\",\"avaliacao\",IF(VLOOKUP(AU$12,RESP!$F$15:$G$64,2,0)=\"Qualitativa\",\"qualit\",\"\"))),\"\")","v":""},{"$f":"IFERROR(IF(VLOOKUP(AV$12,RESP!$F$15:$G$64,2,0)=\"Binária\",\"bin\",IF(VLOOKUP(AV$12,RESP!$F$15:$G$64,2,0)=\"Avaliação\",\"avaliacao\",IF(VLOOKUP(AV$12,RESP!$F$15:$G$64,2,0)=\"Qualitativa\",\"qualit\",\"\"))),\"\")","v":""},{"$f":"IFERROR(IF(VLOOKUP(AW$12,RESP!$F$15:$G$64,2,0)=\"Binária\",\"bin\",IF(VLOOKUP(AW$12,RESP!$F$15:$G$64,2,0)=\"Avaliação\",\"avaliacao\",IF(VLOOKUP(AW$12,RESP!$F$15:$G$64,2,0)=\"Qualitativa\",\"qualit\",\"\"))),\"\")","v":""},{"$f":"IFERROR(IF(VLOOKUP(AX$12,RESP!$F$15:$G$64,2,0)=\"Binária\",\"bin\",IF(VLOOKUP(AX$12,RESP!$F$15:$G$64,2,0)=\"Avaliação\",\"avaliacao\",IF(VLOOKUP(AX$12,RESP!$F$15:$G$64,2,0)=\"Qualitativa\",\"qualit\",\"\"))),\"\")","v":""},{"$f":"IFERROR(IF(VLOOKUP(AY$12,RESP!$F$15:$G$64,2,0)=\"Binária\",\"bin\",IF(VLOOKUP(AY$12,RESP!$F$15:$G$64,2,0)=\"Avaliação\",\"avaliacao\",IF(VLOOKUP(AY$12,RESP!$F$15:$G$64,2,0)=\"Qualitativa\",\"qualit\",\"\"))),\"\")","v":""},{"$f":"IFERROR(IF(VLOOKUP(AZ$12,RESP!$F$15:$G$64,2,0)=\"Binária\",\"bin\",IF(VLOOKUP(AZ$12,RESP!$F$15:$G$64,2,0)=\"Avaliação\",\"avaliacao\",IF(VLOOKUP(AZ$12,RESP!$F$15:$G$64,2,0)=\"Qualitativa\",\"qualit\",\"\"))),\"\")","v":""}]
[null,{"$f":"RESP!B15","v":"Sim"},{"$f":"COUNTIF(C$14:C$114,$B116)","v":3},{"$f":"COUNTIF(D$14:D$114,$B116)","v":0},0,0,0,0,0,0,0,0,0,0,0,0,0,0,0,0,0,0,0,0,0,0,0,0,0,0,0,0,0,0,0,0,0,0,0,0,0,0,0,0,0,0,0,0,0,0,0,0]
[null,{"$f":"RESP!B16","v":"Não"},{"$f":"COUNTIF(C$14:C$114,$B117)","v":2},0,0,0,0,0,0,0,0,0,0,0,0,0,0,0,0,0,0,0,0,0,0,0,0,0,0,0,0,0,0,0,0,0,0,0,0,0,0,0,0,0,0,0,0,0,0,0,0,0]
[]
[null,{"$f":"RESP!C15","v":"Excelente"},{"$f":"COUNTIF(C$14:C$114,$B119)","v":0},{"$f":"COUNTIF(D$14:D$114,$B119)","v":2},0,0,0,0,0,0,0,0,0,0,0,0,0,0,0,0,0,0,0,0,0,0,0,0,0,0,0,0,0,0,0,0,0,0,0,0,0,0,0,0,0,0,0,0,0,0,0,0]
[null,{"$f":"RESP!C16","v":"Bom"},{"$f":"COUNTIF(C$14:C$114,$B120)","v":0},1,0,0,0,0,0,0,0,0,0,0,0,0,0,0,0,0,0,0,0,0,0,0,0,0,0,0,0,0,0,0,0,0,0,0,0,0,0,0,0,0,0,0,0,0,0,0,0,0]
[null,{"$f":"RESP!C17","v":"Ruim"},0,1,0,0,0,0,0,0,0,0,0,0,0,0,0,0,0,0,0,0,0,0,0,0,0,0,0,0,0,0,0,0,0,0,0,0,0,0,0,0,0,0,0,0,0,0,0,0,0,0]
[null,{"$f":"RESP!C18","v":"Péssimo"},0,1,0,0,0,0,0,0,0,0,0,0,0,0,0,0,0,0,0,0,0,0,0,0,0,0,0,0,0,0,0,0,0,0,0,0,0,0,0,0,0,0,0,0,0,0,0,0,0,0]
[]
[null,{"$f":"RESP!D15","v":1},{"$f":"COUNTIF(C$14:C$114,$B124)","v":0},{"$f":"COUNTIF(D$14:D$114,$B124)","v":0},0,0,0,0,0,0,0,0,0,0,0,0,0,0,0,0,0,0,0,0,0,0,0,0,0,0,0,0,0,0,0,0,0,0,0,0,0,0,0,0,0,0,0,0,0,0,0,0]
[null,{"$f":"RESP!D16","v":2},{"$f":"COUNTIF(C$14:C$114,$B125)","v":0},0,2,0,0,0,0,0,0,0,0,0,0,0,0,0,0,0,0,0,0,0,0,0,0,0,0,0,0,0,0,0,0,0,0,0,0,0,0,0,0,0,0,0,0,0,0,0,0,0]
[null,{"$f":"RESP!D17","v":3},0,0,0,0,0,0,0,0,0,0,0,0,0,0,0,0,0,0,0,0,0,0,0,0,0,0,0,0,0,0,0,0,0,0,0,0,0,0,0,0,0,0,0,0,0,0,0,0,0,0]
[null,{"$f":"RESP!D18","v":4},0,0,1,0,0,0,0,0,0,0,0,0,0,0,0,0,0,0,0,0,0,0,0,0,0,0,0,0,0,0,0,0,0,0,0,0,0,0,0,0,0,0,0,0,0,0,0,0,0,0]
[null,{"$f":"RESP!D19","v":5},0,0,1,0,0,0,0,0,0,0,0,0,0,0,0,0,0,0,0,0,0,0,0,0,0,0,0,0,0,0,0,0,0,0,0,0,0,0,0,0,0,0,0,0,0,0,0,0,0,0]
[null,{"$f":"RESP!D20","v":6},0,0,0,0,0,0,0,0,0,0,0,0,0,0,0,0,0,0,0,0,0,0,0,0,0,0,{"$f":"COUNTIF(AC$14:AC$114,$B129)","v":0},0,0,0,0,0,0,0,0,0,0,0,0,0,0,0,0,0,0,0,0,0,0,0]
[null,{"$f":"RESP!D21","v":7},0,0,0,0,0,0,0,0,0,0,0,0,0,0,0,0,0,0,0,0,0,0,0,0,0,0,0,0,0,0,0,0,0,0,0,0,0,0,0,0,0,0,0,0,0,0,0,0,0,0]
[null,{"$f":"RESP!D22","v":8},0,0,0,0,0,0,0,0,0,0,0,0,0,0,0,0,0,0,0,0,0,0,0,0,0,0,0,0,0,0,0,0,0,0,0,0,0,0,0,0,0,0,0,0,0,0,0,0,0,0]
[null,{"$f":"RESP!D23","v":9},0,0,0,0,0,0,0,0,0,0,0,0,0,0,0,0,0,0,0,0,0,0,0,0,0,0,0,0,0,0,0,0,0,0,0,0,0,0,0,0,0,0,0,0,0,0,0,0,0,0]
[null,{"$f":"RESP!D24","v":10},0,0,1,0,0,0,0,0,0,0,0,0,0,0,0,0,0,0,0,0,0,0,0,0,0,0,0,0,0,0,0,0,0,0,0,0,0,0,0,0,0,0,0,0,0,0,0,0,0,0]
[]
[]
[null,"Nota Total Realizada",{"$f":"IF(SUM(C116:C133)=0,\"\",SUM(C116*10,C119*10,C120*8,C121*4,C124*1,C125*2,C126*3,C127*4,C128*5,C129*6,C130*7,C131*8,C132*9,C133*10))","v":30},32,23,"","","","","","","","","","","","","","","","","","","","","","","","","","","","","",{"$f":"IF(SUM(AI116:AI133)=0,\"\",SUM(AI116*10,AI119*10,AI120*8,AI121*4,AI124*1,AI125*2,AI126*3,AI127*4,AI128*5,AI129*6,AI130*7,AI131*8,AI132*9,AI133*10))","v":""},"","","","","","","","","","","","","","","","",""]
[null,"Nota Total Possível (100%)",{"$f":"IF(SUM(C116:C133)=0,\"\",SUM(SUM(C116:C117)*10,SUM(C119:C122)*10,SUM(C124:C133)*10))","v":50},50,50,"","","","","","","","","","","","","","","","","","","","","","","","","","","","","",{"$f":"IF(SUM(AI116:AI133)=0,\"\",SUM(SUM(AI116:AI117)*10,SUM(AI119:AI122)*10,SUM(AI124:AI133)*10))","v":""},"","","","","","","","","","","","","","","","",""]
[null,"Porcentagem Alcançada",{"$f":"IFERROR(C136/C137,\"\")","v":0.6},{"$f":"IFERROR(D136/D137,\"\")","v":0.64},0.46,"","","","","","","","","","","","","","","","","","","","","","","","","","","","","","","","","","","","","","","","","","","","","","",""]
[null,"Pergunta",{"$f":"C12","v":"Você indicaria nossos produtos?"},"Qual sua avaliação em relação ao prazo de entrega dos produtos?","Qual sua nota referente ao nosso atendimento telefônico?","O Produto atendeu as suas expectativas?",0,0,0,0,0,0,0,0,0,0,0,0,0,0,0,0,0,0,0,0,0,0,0,0,0,0,0,0,{"$f":"AI12","v":0},0,0,0,0,0,0,0,0,0,0,0,0,0,0,0,0,0]

{"sheet":"RELAT","index":4,"n_rows":31,"n_cols":52,"rows_kept":31,"cut":false,"hidden":false,"merged":[[11,1,12,1],[11,46,12,46],[11,47,12,47],[11,48,12,48],[11,49,12,49],[11,34,12,34],[11,35,12,35],[11,36,12,36],[11,37,12,37],[11,38,12,38],[11,39,12,39],[11,28,12,28],[11,29,12,29],[11,30,12,30],[11,31,12,31],[11,32,12,32],[11,50,12,50],[11,51,12,51],[11,40,12,40],[11,41,12,41],[11,42,12,42],[11,43,12,43],[11,44,12,44],[11,45,12,45],[11,33,12,33],[11,22,12,22],[11,23,12,23],[11,24,12,24],[11,25,12,25],[11,26,12,26],[11,27,12,27],[11,21,12,21],[11,10,12,10],[11,11,12,11],[11,12,12,12],[11,13,12,13],[11,14,12,14],[11,15,12,15],[11,16,12,16],[11,17,12,17],[11,18,12,18],[11,19,12,19],[11,20,12,20],[11,7,12,7],[11,8,12,8],[11,9,12,9],[11,2,12,2],[11,3,12,3],[11,4,12,4],[11,5,12,5],[11,6,12,6]]}
[]
[]
[]
[]
[]
[]
[]
[]
[]
[]
[]
[null,"Perguntas",{"$f":"RESP!$F$15","v":"Você indicaria nossos produtos?"},{"$f":"RESP!$F$16","v":"Qual sua avaliação em relação ao prazo de entrega dos produtos?"},{"$f":"RESP!$F$17","v":"Qual sua nota referente ao nosso atendimento telefônico?"},{"$f":"RESP!$F$18","v":"O Produto atendeu as suas expectativas?"},{"$f":"RESP!$F$19","v":0},{"$f":"RESP!$F$20","v":0},{"$f":"RESP!$F$21","v":0},{"$f":"RESP!$F$22","v":0},{"$f":"RESP!$F$23","v":0},{"$f":"RESP!$F$24","v":0},{"$f":"RESP!$F$25","v":0},{"$f":"RESP!$F$26","v":0},{"$f":"RESP!$F$27","v":0},{"$f":"RESP!$F$28","v":0},{"$f":"RESP!$F$29","v":0},{"$f":"RESP!$F$30","v":0},{"$f":"RESP!$F$31","v":0},{"$f":"RESP!$F$32","v":0},{"$f":"RESP!$F$33","v":0},{"$f":"RESP!$F$34","v":0},{"$f":"RESP!$F$35","v":0},{"$f":"RESP!$F$36","v":0},{"$f":"RESP!$F$37","v":0},{"$f":"RESP!$F$38","v":0},{"$f":"RESP!$F$39","v":0},{"$f":"RESP!$F$40","v":0},{"$f":"RESP!$F$41","v":0},{"$f":"RESP!$F$42","v":0},{"$f":"RESP!$F$43","v":0},{"$f":"RESP!$F$44","v":0},{"$f":"RESP!$F$45","v":0},{"$f":"RESP!$F$46","v":0},{"$f":"RESP!$F$47","v":0},{"$f":"RESP!$F$48","v":0},{"$f":"RESP!$F$49","v":0},{"$f":"RESP!$F$50","v":0},{"$f":"RESP!$F$51","v":0},{"$f":"RESP!$F$52","v":0},{"$f":"RESP!$F$53","v":0},{"$f":"RESP!$F$54","v":0},{"$f":"RESP!$F$55","v":0},{"$f":"RESP!$F$56","v":0},{"$f":"RESP!$F$57","v":0},{"$f":"RESP!$F$58","v":0},{"$f":"RESP!$F$59","v":0},{"$f":"RESP!$F$60","v":0},{"$f":"RESP!$F$61","v":0},{"$f":"RESP!$F$62","v":0},{"$f":"RESP!$F$63","v":0},{"$f":"RESP!$F$64","v":0}]
[]
[null,"Total de Respostas",{"$f":"COUNTA(PESQ!C14:C114)","v":5},{"$f":"COUNTA(PESQ!D14:D114)","v":5},{"$f":"COUNTA(PESQ!E14:E114)","v":5},{"$f":"COUNTA(PESQ!F14:F114)","v":0},{"$f":"COUNTA(PESQ!G14:G114)","v":0},{"$f":"COUNTA(PESQ!H14:H114)","v":0},{"$f":"COUNTA(PESQ!I14:I114)","v":0},{"$f":"COUNTA(PESQ!J14:J114)","v":0},{"$f":"COUNTA(PESQ!K14:K114)","v":0},{"$f":"COUNTA(PESQ!L14:L114)","v":0},{"$f":"COUNTA(PESQ!M14:M114)","v":0},{"$f":"COUNTA(PESQ!N14:N114)","v":0},{"$f":"COUNTA(PESQ!O14:O114)","v":0},{"$f":"COUNTA(PESQ!P14:P114)","v":0},{"$f":"COUNTA(PESQ!Q14:Q114)","v":0},{"$f":"COUNTA(PESQ!R14:R114)","v":0},{"$f":"COUNTA(PESQ!S14:S114)","v":0},{"$f":"COUNTA(PESQ!T14:T114)","v":0},{"$f":"COUNTA(PESQ!U14:U114)","v":0},{"$f":"COUNTA(PESQ!V14:V114)","v":0},{"$f":"COUNTA(PESQ!W14:W114)","v":0},{"$f":"COUNTA(PESQ!X14:X114)","v":0},{"$f":"COUNTA(PESQ!Y14:Y114)","v":0},{"$f":"COUNTA(PESQ!Z14:Z114)","v":0},{"$f":"COUNTA(PESQ!AA14:AA114)","v":0},{"$f":"COUNTA(PESQ!AB14:AB114)","v":0},{"$f":"COUNTA(PESQ!AC14:AC114)","v":0},{"$f":"COUNTA(PESQ!AD14:AD114)","v":0},{"$f":"COUNTA(PESQ!AE14:AE114)","v":0},{"$f":"COUNTA(PESQ!AF14:AF114)","v":0},{"$f":"COUNTA(PESQ!AG14:AG114)","v":0},{"$f":"COUNTA(PESQ!AH14:AH114)","v":0},{"$f":"COUNTA(PESQ!AI14:AI114)","v":0},{"$f":"COUNTA(PESQ!AJ14:AJ114)","v":0},{"$f":"COUNTA(PESQ!AK14:AK114)","v":0},{"$f":"COUNTA(PESQ!AL14:AL114)","v":0},{"$f":"COUNTA(PESQ!AM14:AM114)","v":0},{"$f":"COUNTA(PESQ!AN14:AN114)","v":0},{"$f":"COUNTA(PESQ!AO14:AO114)","v":0},{"$f":"COUNTA(PESQ!AP14:AP114)","v":0},{"$f":"COUNTA(PESQ!AQ14:AQ114)","v":0},{"$f":"COUNTA(PESQ!AR14:AR114)","v":0},{"$f":"COUNTA(PESQ!AS14:AS114)","v":0},{"$f":"COUNTA(PESQ!AT14:AT114)","v":0},{"$f":"COUNTA(PESQ!AU14:AU114)","v":0},{"$f":"COUNTA(PESQ!AV14:AV114)","v":0},{"$f":"COUNTA(PESQ!AW14:AW114)","v":0},{"$f":"COUNTA(PESQ!AX14:AX114)","v":0},{"$f":"COUNTA(PESQ!AY14:AY114)","v":0},{"$f":"COUNTA(PESQ!AZ14:AZ114)","v":0}]
[null,"Sim",{"$f":"IF(C$14=0,\"\",IF(C$31<>\"bin\",\"Não se aplica\",COUNTIF(PESQ!C$14:C$114,RELAT!$B15)))","v":3},{"$f":"IF(D$14=0,\"\",IF(D$31<>\"bin\",\"Não se aplica\",COUNTIF(PESQ!D$14:D$114,RELAT!$B15)))","v":"Não se aplica"},{"$f":"IF(E$14=0,\"\",IF(E$31<>\"bin\",\"Não se aplica\",COUNTIF(PESQ!E$14:E$114,RELAT!$B15)))","v":"Não se aplica"},{"$f":"IF(F$14=0,\"\",IF(F$31<>\"bin\",\"Não se aplica\",COUNTIF(PESQ!F$14:F$114,RELAT!$B15)))","v":""},{"$f":"IF(G$14=0,\"\",IF(G$31<>\"bin\",\"Não se aplica\",COUNTIF(PESQ!G$14:G$114,RELAT!$B15)))","v":""},{"$f":"IF(H$14=0,\"\",IF(H$31<>\"bin\",\"Não se aplica\",COUNTIF(PESQ!H$14:H$114,RELAT!$B15)))","v":""},{"$f":"IF(I$14=0,\"\",IF(I$31<>\"bin\",\"Não se aplica\",COUNTIF(PESQ!I$14:I$114,RELAT!$B15)))","v":""},{"$f":"IF(J$14=0,\"\",IF(J$31<>\"bin\",\"Não se aplica\",COUNTIF(PESQ!J$14:J$114,RELAT!$B15)))","v":""},{"$f":"IF(K$14=0,\"\",IF(K$31<>\"bin\",\"Não se aplica\",COUNTIF(PESQ!K$14:K$114,RELAT!$B15)))","v":""},{"$f":"IF(L$14=0,\"\",IF(L$31<>\"bin\",\"Não se aplica\",COUNTIF(PESQ!L$14:L$114,RELAT!$B15)))","v":""},{"$f":"IF(M$14=0,\"\",IF(M$31<>\"bin\",\"Não se aplica\",COUNTIF(PESQ!M$14:M$114,RELAT!$B15)))","v":""},{"$f":"IF(N$14=0,\"\",IF(N$31<>\"bin\",\"Não se aplica\",COUNTIF(PESQ!N$14:N$114,RELAT!$B15)))","v":""},{"$f":"IF(O$14=0,\"\",IF(O$31<>\"bin\",\"Não se aplica\",COUNTIF(PESQ!O$14:O$114,RELAT!$B15)))","v":""},{"$f":"IF(P$14=0,\"\",IF(P$31<>\"bin\",\"Não se aplica\",COUNTIF(PESQ!P$14:P$114,RELAT!$B15)))","v":""},{"$f":"IF(Q$14=0,\"\",IF(Q$31<>\"bin\",\"Não se aplica\",COUNTIF(PESQ!Q$14:Q$114,RELAT!$B15)))","v":""},{"$f":"IF(R$14=0,\"\",IF(R$31<>\"bin\",\"Não se aplica\",COUNTIF(PESQ!R$14:R$114,RELAT!$B15)))","v":""},{"$f":"IF(S$14=0,\"\",IF(S$31<>\"bin\",\"Não se aplica\",COUNTIF(PESQ!S$14:S$114,RELAT!$B15)))","v":""},{"$f":"IF(T$14=0,\"\",IF(T$31<>\"bin\",\"Não se aplica\",COUNTIF(PESQ!T$14:T$114,RELAT!$B15)))","v":""},{"$f":"IF(U$14=0,\"\",IF(U$31<>\"bin\",\"Não se aplica\",COUNTIF(PESQ!U$14:U$114,RELAT!$B15)))","v":""},{"$f":"IF(V$14=0,\"\",IF(V$31<>\"bin\",\"Não se aplica\",COUNTIF(PESQ!V$14:V$114,RELAT!$B15)))","v":""},{"$f":"IF(W$14=0,\"\",IF(W$31<>\"bin\",\"Não se aplica\",COUNTIF(PESQ!W$14:W$114,RELAT!$B15)))","v":""},{"$f":"IF(X$14=0,\"\",IF(X$31<>\"bin\",\"Não se aplica\",COUNTIF(PESQ!X$14:X$114,RELAT!$B15)))","v":""},{"$f":"IF(Y$14=0,\"\",IF(Y$31<>\"bin\",\"Não se aplica\",COUNTIF(PESQ!Y$14:Y$114,RELAT!$B15)))","v":""},{"$f":"IF(Z$14=0,\"\",IF(Z$31<>\"bin\",\"Não se aplica\",COUNTIF(PESQ!Z$14:Z$114,RELAT!$B15)))","v":""},{"$f":"IF(AA$14=0,\"\",IF(AA$31<>\"bin\",\"Não se aplica\",COUNTIF(PESQ!AA$14:AA$114,RELAT!$B15)))","v":""},{"$f":"IF(AB$14=0,\"\",IF(AB$31<>\"bin\",\"Não se aplica\",COUNTIF(PESQ!AB$14:AB$114,RELAT!$B15)))","v":""},{"$f":"IF(AC$14=0,\"\",IF(AC$31<>\"bin\",\"Não se aplica\",COUNTIF(PESQ!AC$14:AC$114,RELAT!$B15)))","v":""},{"$f":"IF(AD$14=0,\"\",IF(AD$31<>\"bin\",\"Não se aplica\",COUNTIF(PESQ!AD$14:AD$114,RELAT!$B15)))","v":""},{"$f":"IF(AE$14=0,\"\",IF(AE$31<>\"bin\",\"Não se aplica\",COUNTIF(PESQ!AE$14:AE$114,RELAT!$B15)))","v":""},{"$f":"IF(AF$14=0,\"\",IF(AF$31<>\"bin\",\"Não se aplica\",COUNTIF(PESQ!AF$14:AF$114,RELAT!$B15)))","v":""},{"$f":"IF(AG$14=0,\"\",IF(AG$31<>\"bin\",\"Não se aplica\",COUNTIF(PESQ!AG$14:AG$114,RELAT!$B15)))","v":""},{"$f":"IF(AH$14=0,\"\",IF(AH$31<>\"bin\",\"Não se aplica\",COUNTIF(PESQ!AH$14:AH$114,RELAT!$B15)))","v":""},{"$f":"IF(AI$14=0,\"\",IF(AI$31<>\"bin\",\"Não se aplica\",COUNTIF(PESQ!AI$14:AI$114,RELAT!$B15)))","v":""},{"$f":"IF(AJ$14=0,\"\",IF(AJ$31<>\"bin\",\"Não se aplica\",COUNTIF(PESQ!AJ$14:AJ$114,RELAT!$B15)))","v":""},{"$f":"IF(AK$14=0,\"\",IF(AK$31<>\"bin\",\"Não se aplica\",COUNTIF(PESQ!AK$14:AK$114,RELAT!$B15)))","v":""},{"$f":"IF(AL$14=0,\"\",IF(AL$31<>\"bin\",\"Não se aplica\",COUNTIF(PESQ!AL$14:AL$114,RELAT!$B15)))","v":""},{"$f":"IF(AM$14=0,\"\",IF(AM$31<>\"bin\",\"Não se aplica\",COUNTIF(PESQ!AM$14:AM$114,RELAT!$B15)))","v":""},{"$f":"IF(AN$14=0,\"\",IF(AN$31<>\"bin\",\"Não se aplica\",COUNTIF(PESQ!AN$14:AN$114,RELAT!$B15)))","v":""},{"$f":"IF(AO$14=0,\"\",IF(AO$31<>\"bin\",\"Não se aplica\",COUNTIF(PESQ!AO$14:AO$114,RELAT!$B15)))","v":""},{"$f":"IF(AP$14=0,\"\",IF(AP$31<>\"bin\",\"Não se aplica\",COUNTIF(PESQ!AP$14:AP$114,RELAT!$B15)))","v":""},{"$f":"IF(AQ$14=0,\"\",IF(AQ$31<>\"bin\",\"Não se aplica\",COUNTIF(PESQ!AQ$14:AQ$114,RELAT!$B15)))","v":""},{"$f":"IF(AR$14=0,\"\",IF(AR$31<>\"bin\",\"Não se aplica\",COUNTIF(PESQ!AR$14:AR$114,RELAT!$B15)))","v":""},{"$f":"IF(AS$14=0,\"\",IF(AS$31<>\"bin\",\"Não se aplica\",COUNTIF(PESQ!AS$14:AS$114,RELAT!$B15)))","v":""},{"$f":"IF(AT$14=0,\"\",IF(AT$31<>\"bin\",\"Não se aplica\",COUNTIF(PESQ!AT$14:AT$114,RELAT!$B15)))","v":""},{"$f":"IF(AU$14=0,\"\",IF(AU$31<>\"bin\",\"Não se aplica\",COUNTIF(PESQ!AU$14:AU$114,RELAT!$B15)))","v":""},{"$f":"IF(AV$14=0,\"\",IF(AV$31<>\"bin\",\"Não se aplica\",COUNTIF(PESQ!AV$14:AV$114,RELAT!$B15)))","v":""},{"$f":"IF(AW$14=0,\"\",IF(AW$31<>\"bin\",\"Não se aplica\",COUNTIF(PESQ!AW$14:AW$114,RELAT!$B15)))","v":""},{"$f":"IF(AX$14=0,\"\",IF(AX$31<>\"bin\",\"Não se aplica\",COUNTIF(PESQ!AX$14:AX$114,RELAT!$B15)))","v":""},{"$f":"IF(AY$14=0,\"\",IF(AY$31<>\"bin\",\"Não se aplica\",COUNTIF(PESQ!AY$14:AY$114,RELAT!$B15)))","v":""},{"$f":"IF(AZ$14=0,\"\",IF(AZ$31<>\"bin\",\"Não se aplica\",COUNTIF(PESQ!AZ$14:AZ$114,RELAT!$B15)))","v":""}]
[null,"Não",{"$f":"IF(C$14=0,\"\",IF(C$31<>\"bin\",\"Não se aplica\",COUNTIF(PESQ!C$14:C$114,RELAT!$B16)))","v":2},{"$f":"IF(D$14=0,\"\",IF(D$31<>\"bin\",\"Não se aplica\",COUNTIF(PESQ!D$14:D$114,RELAT!$B16)))","v":"Não se aplica"},{"$f":"IF(E$14=0,\"\",IF(E$31<>\"bin\",\"Não se aplica\",COUNTIF(PESQ!E$14:E$114,RELAT!$B16)))","v":"Não se aplica"},{"$f":"IF(F$14=0,\"\",IF(F$31<>\"bin\",\"Não se aplica\",COUNTIF(PESQ!F$14:F$114,RELAT!$B16)))","v":""},{"$f":"IF(G$14=0,\"\",IF(G$31<>\"bin\",\"Não se aplica\",COUNTIF(PESQ!G$14:G$114,RELAT!$B16)))","v":""},{"$f":"IF(H$14=0,\"\",IF(H$31<>\"bin\",\"Não se aplica\",COUNTIF(PESQ!H$14:H$114,RELAT!$B16)))","v":""},{"$f":"IF(I$14=0,\"\",IF(I$31<>\"bin\",\"Não se aplica\",COUNTIF(PESQ!I$14:I$114,RELAT!$B16)))","v":""},{"$f":"IF(J$14=0,\"\",IF(J$31<>\"bin\",\"Não se aplica\",COUNTIF(PESQ!J$14:J$114,RELAT!$B16)))","v":""},{"$f":"IF(K$14=0,\"\",IF(K$31<>\"bin\",\"Não se aplica\",COUNTIF(PESQ!K$14:K$114,RELAT!$B16)))","v":""},{"$f":"IF(L$14=0,\"\",IF(L$31<>\"bin\",\"Não se aplica\",COUNTIF(PESQ!L$14:L$114,RELAT!$B16)))","v":""},{"$f":"IF(M$14=0,\"\",IF(M$31<>\"bin\",\"Não se aplica\",COUNTIF(PESQ!M$14:M$114,RELAT!$B16)))","v":""},{"$f":"IF(N$14=0,\"\",IF(N$31<>\"bin\",\"Não se aplica\",COUNTIF(PESQ!N$14:N$114,RELAT!$B16)))","v":""},{"$f":"IF(O$14=0,\"\",IF(O$31<>\"bin\",\"Não se aplica\",COUNTIF(PESQ!O$14:O$114,RELAT!$B16)))","v":""},{"$f":"IF(P$14=0,\"\",IF(P$31<>\"bin\",\"Não se aplica\",COUNTIF(PESQ!P$14:P$114,RELAT!$B16)))","v":""},{"$f":"IF(Q$14=0,\"\",IF(Q$31<>\"bin\",\"Não se aplica\",COUNTIF(PESQ!Q$14:Q$114,RELAT!$B16)))","v":""},{"$f":"IF(R$14=0,\"\",IF(R$31<>\"bin\",\"Não se aplica\",COUNTIF(PESQ!R$14:R$114,RELAT!$B16)))","v":""},{"$f":"IF(S$14=0,\"\",IF(S$31<>\"bin\",\"Não se aplica\",COUNTIF(PESQ!S$14:S$114,RELAT!$B16)))","v":""},{"$f":"IF(T$14=0,\"\",IF(T$31<>\"bin\",\"Não se aplica\",COUNTIF(PESQ!T$14:T$114,RELAT!$B16)))","v":""},{"$f":"IF(U$14=0,\"\",IF(U$31<>\"bin\",\"Não se aplica\",COUNTIF(PESQ!U$14:U$114,RELAT!$B16)))","v":""},{"$f":"IF(V$14=0,\"\",IF(V$31<>\"bin\",\"Não se aplica\",COUNTIF(PESQ!V$14:V$114,RELAT!$B16)))","v":""},{"$f":"IF(W$14=0,\"\",IF(W$31<>\"bin\",\"Não se aplica\",COUNTIF(PESQ!W$14:W$114,RELAT!$B16)))","v":""},{"$f":"IF(X$14=0,\"\",IF(X$31<>\"bin\",\"Não se aplica\",COUNTIF(PESQ!X$14:X$114,RELAT!$B16)))","v":""},{"$f":"IF(Y$14=0,\"\",IF(Y$31<>\"bin\",\"Não se aplica\",COUNTIF(PESQ!Y$14:Y$114,RELAT!$B16)))","v":""},{"$f":"IF(Z$14=0,\"\",IF(Z$31<>\"bin\",\"Não se aplica\",COUNTIF(PESQ!Z$14:Z$114,RELAT!$B16)))","v":""},{"$f":"IF(AA$14=0,\"\",IF(AA$31<>\"bin\",\"Não se aplica\",COUNTIF(PESQ!AA$14:AA$114,RELAT!$B16)))","v":""},{"$f":"IF(AB$14=0,\"\",IF(AB$31<>\"bin\",\"Não se aplica\",COUNTIF(PESQ!AB$14:AB$114,RELAT!$B16)))","v":""},{"$f":"IF(AC$14=0,\"\",IF(AC$31<>\"bin\",\"Não se aplica\",COUNTIF(PESQ!AC$14:AC$114,RELAT!$B16)))","v":""},{"$f":"IF(AD$14=0,\"\",IF(AD$31<>\"bin\",\"Não se aplica\",COUNTIF(PESQ!AD$14:AD$114,RELAT!$B16)))","v":""},{"$f":"IF(AE$14=0,\"\",IF(AE$31<>\"bin\",\"Não se aplica\",COUNTIF(PESQ!AE$14:AE$114,RELAT!$B16)))","v":""},{"$f":"IF(AF$14=0,\"\",IF(AF$31<>\"bin\",\"Não se aplica\",COUNTIF(PESQ!AF$14:AF$114,RELAT!$B16)))","v":""},{"$f":"IF(AG$14=0,\"\",IF(AG$31<>\"bin\",\"Não se aplica\",COUNTIF(PESQ!AG$14:AG$114,RELAT!$B16)))","v":""},{"$f":"IF(AH$14=0,\"\",IF(AH$31<>\"bin\",\"Não se aplica\",COUNTIF(PESQ!AH$14:AH$114,RELAT!$B16)))","v":""},{"$f":"IF(AI$14=0,\"\",IF(AI$31<>\"bin\",\"Não se aplica\",COUNTIF(PESQ!AI$14:AI$114,RELAT!$B16)))","v":""},{"$f":"IF(AJ$14=0,\"\",IF(AJ$31<>\"bin\",\"Não se aplica\",COUNTIF(PESQ!AJ$14:AJ$114,RELAT!$B16)))","v":""},{"$f":"IF(AK$14=0,\"\",IF(AK$31<>\"bin\",\"Não se aplica\",COUNTIF(PESQ!AK$14:AK$114,RELAT!$B16)))","v":""},{"$f":"IF(AL$14=0,\"\",IF(AL$31<>\"bin\",\"Não se aplica\",COUNTIF(PESQ!AL$14:AL$114,RELAT!$B16)))","v":""},{"$f":"IF(AM$14=0,\"\",IF(AM$31<>\"bin\",\"Não se aplica\",COUNTIF(PESQ!AM$14:AM$114,RELAT!$B16)))","v":""},{"$f":"IF(AN$14=0,\"\",IF(AN$31<>\"bin\",\"Não se aplica\",COUNTIF(PESQ!AN$14:AN$114,RELAT!$B16)))","v":""},{"$f":"IF(AO$14=0,\"\",IF(AO$31<>\"bin\",\"Não se aplica\",COUNTIF(PESQ!AO$14:AO$114,RELAT!$B16)))","v":""},{"$f":"IF(AP$14=0,\"\",IF(AP$31<>\"bin\",\"Não se aplica\",COUNTIF(PESQ!AP$14:AP$114,RELAT!$B16)))","v":""},{"$f":"IF(AQ$14=0,\"\",IF(AQ$31<>\"bin\",\"Não se aplica\",COUNTIF(PESQ!AQ$14:AQ$114,RELAT!$B16)))","v":""},{"$f":"IF(AR$14=0,\"\",IF(AR$31<>\"bin\",\"Não se aplica\",COUNTIF(PESQ!AR$14:AR$114,RELAT!$B16)))","v":""},{"$f":"IF(AS$14=0,\"\",IF(AS$31<>\"bin\",\"Não se aplica\",COUNTIF(PESQ!AS$14:AS$114,RELAT!$B16)))","v":""},{"$f":"IF(AT$14=0,\"\",IF(AT$31<>\"bin\",\"Não se aplica\",COUNTIF(PESQ!AT$14:AT$114,RELAT!$B16)))","v":""},{"$f":"IF(AU$14=0,\"\",IF(AU$31<>\"bin\",\"Não se aplica\",COUNTIF(PESQ!AU$14:AU$114,RELAT!$B16)))","v":""},{"$f":"IF(AV$14=0,\"\",IF(AV$31<>\"bin\",\"Não se aplica\",COUNTIF(PESQ!AV$14:AV$114,RELAT!$B16)))","v":""},{"$f":"IF(AW$14=0,\"\",IF(AW$31<>\"bin\",\"Não se aplica\",COUNTIF(PESQ!AW$14:AW$114,RELAT!$B16)))","v":""},{"$f":"IF(AX$14=0,\"\",IF(AX$31<>\"bin\",\"Não se aplica\",COUNTIF(PESQ!AX$14:AX$114,RELAT!$B16)))","v":""},{"$f":"IF(AY$14=0,\"\",IF(AY$31<>\"bin\",\"Não se aplica\",COUNTIF(PESQ!AY$14:AY$114,RELAT!$B16)))","v":""},{"$f":"IF(AZ$14=0,\"\",IF(AZ$31<>\"bin\",\"Não se aplica\",COUNTIF(PESQ!AZ$14:AZ$114,RELAT!$B16)))","v":""}]
[null,"Excelente",{"$f":"IF(C$14=0,\"\",IF(C$31<>\"avaliacao\",\"Não se aplica\",COUNTIF(PESQ!C$14:C$114,RELAT!$B17)))","v":"Não se aplica"},{"$f":"IF(D$14=0,\"\",IF(D$31<>\"avaliacao\",\"Não se aplica\",COUNTIF(PESQ!D$14:D$114,RELAT!$B17)))","v":2},{"$f":"IF(E$14=0,\"\",IF(E$31<>\"avaliacao\",\"Não se aplica\",COUNTIF(PESQ!E$14:E$114,RELAT!$B17)))","v":"Não se aplica"},{"$f":"IF(F$14=0,\"\",IF(F$31<>\"avaliacao\",\"Não se aplica\",COUNTIF(PESQ!F$14:F$114,RELAT!$B17)))","v":""},{"$f":"IF(G$14=0,\"\",IF(G$31<>\"avaliacao\",\"Não se aplica\",COUNTIF(PESQ!G$14:G$114,RELAT!$B17)))","v":""},{"$f":"IF(H$14=0,\"\",IF(H$31<>\"avaliacao\",\"Não se aplica\",COUNTIF(PESQ!H$14:H$114,RELAT!$B17)))","v":""},{"$f":"IF(I$14=0,\"\",IF(I$31<>\"avaliacao\",\"Não se aplica\",COUNTIF(PESQ!I$14:I$114,RELAT!$B17)))","v":""},{"$f":"IF(J$14=0,\"\",IF(J$31<>\"avaliacao\",\"Não se aplica\",COUNTIF(PESQ!J$14:J$114,RELAT!$B17)))","v":""},{"$f":"IF(K$14=0,\"\",IF(K$31<>\"avaliacao\",\"Não se aplica\",COUNTIF(PESQ!K$14:K$114,RELAT!$B17)))","v":""},{"$f":"IF(L$14=0,\"\",IF(L$31<>\"avaliacao\",\"Não se aplica\",COUNTIF(PESQ!L$14:L$114,RELAT!$B17)))","v":""},{"$f":"IF(M$14=0,\"\",IF(M$31<>\"avaliacao\",\"Não se aplica\",COUNTIF(PESQ!M$14:M$114,RELAT!$B17)))","v":""},{"$f":"IF(N$14=0,\"\",IF(N$31<>\"avaliacao\",\"Não se aplica\",COUNTIF(PESQ!N$14:N$114,RELAT!$B17)))","v":""},{"$f":"IF(O$14=0,\"\",IF(O$31<>\"avaliacao\",\"Não se aplica\",COUNTIF(PESQ!O$14:O$114,RELAT!$B17)))","v":""},{"$f":"IF(P$14=0,\"\",IF(P$31<>\"avaliacao\",\"Não se aplica\",COUNTIF(PESQ!P$14:P$114,RELAT!$B17)))","v":""},{"$f":"IF(Q$14=0,\"\",IF(Q$31<>\"avaliacao\",\"Não se aplica\",COUNTIF(PESQ!Q$14:Q$114,RELAT!$B17)))","v":""},{"$f":"IF(R$14=0,\"\",IF(R$31<>\"avaliacao\",\"Não se aplica\",COUNTIF(PESQ!R$14:R$114,RELAT!$B17)))","v":""},{"$f":"IF(S$14=0,\"\",IF(S$31<>\"avaliacao\",\"Não se aplica\",COUNTIF(PESQ!S$14:S$114,RELAT!$B17)))","v":""},{"$f":"IF(T$14=0,\"\",IF(T$31<>\"avaliacao\",\"Não se aplica\",COUNTIF(PESQ!T$14:T$114,RELAT!$B17)))","v":""},{"$f":"IF(U$14=0,\"\",IF(U$31<>\"avaliacao\",\"Não se aplica\",COUNTIF(PESQ!U$14:U$114,RELAT!$B17)))","v":""},{"$f":"IF(V$14=0,\"\",IF(V$31<>\"avaliacao\",\"Não se aplica\",COUNTIF(PESQ!V$14:V$114,RELAT!$B17)))","v":""},{"$f":"IF(W$14=0,\"\",IF(W$31<>\"avaliacao\",\"Não se aplica\",COUNTIF(PESQ!W$14:W$114,RELAT!$B17)))","v":""},{"$f":"IF(X$14=0,\"\",IF(X$31<>\"avaliacao\",\"Não se aplica\",COUNTIF(PESQ!X$14:X$114,RELAT!$B17)))","v":""},{"$f":"IF(Y$14=0,\"\",IF(Y$31<>\"avaliacao\",\"Não se aplica\",COUNTIF(PESQ!Y$14:Y$114,RELAT!$B17)))","v":""},{"$f":"IF(Z$14=0,\"\",IF(Z$31<>\"avaliacao\",\"Não se aplica\",COUNTIF(PESQ!Z$14:Z$114,RELAT!$B17)))","v":""},{"$f":"IF(AA$14=0,\"\",IF(AA$31<>\"avaliacao\",\"Não se aplica\",COUNTIF(PESQ!AA$14:AA$114,RELAT!$B17)))","v":""},{"$f":"IF(AB$14=0,\"\",IF(AB$31<>\"avaliacao\",\"Não se aplica\",COUNTIF(PESQ!AB$14:AB$114,RELAT!$B17)))","v":""},{"$f":"IF(AC$14=0,\"\",IF(AC$31<>\"avaliacao\",\"Não se aplica\",COUNTIF(PESQ!AC$14:AC$114,RELAT!$B17)))","v":""},{"$f":"IF(AD$14=0,\"\",IF(AD$31<>\"avaliacao\",\"Não se aplica\",COUNTIF(PESQ!AD$14:AD$114,RELAT!$B17)))","v":""},{"$f":"IF(AE$14=0,\"\",IF(AE$31<>\"avaliacao\",\"Não se aplica\",COUNTIF(PESQ!AE$14:AE$114,RELAT!$B17)))","v":""},{"$f":"IF(AF$14=0,\"\",IF(AF$31<>\"avaliacao\",\"Não se aplica\",COUNTIF(PESQ!AF$14:AF$114,RELAT!$B17)))","v":""},{"$f":"IF(AG$14=0,\"\",IF(AG$31<>\"avaliacao\",\"Não se aplica\",COUNTIF(PESQ!AG$14:AG$114,RELAT!$B17)))","v":""},{"$f":"IF(AH$14=0,\"\",IF(AH$31<>\"avaliacao\",\"Não se aplica\",COUNTIF(PESQ!AH$14:AH$114,RELAT!$B17)))","v":""},{"$f":"IF(AI$14=0,\"\",IF(AI$31<>\"avaliacao\",\"Não se aplica\",COUNTIF(PESQ!AI$14:AI$114,RELAT!$B17)))","v":""},{"$f":"IF(AJ$14=0,\"\",IF(AJ$31<>\"avaliacao\",\"Não se aplica\",COUNTIF(PESQ!AJ$14:AJ$114,RELAT!$B17)))","v":""},{"$f":"IF(AK$14=0,\"\",IF(AK$31<>\"avaliacao\",\"Não se aplica\",COUNTIF(PESQ!AK$14:AK$114,RELAT!$B17)))","v":""},{"$f":"IF(AL$14=0,\"\",IF(AL$31<>\"avaliacao\",\"Não se aplica\",COUNTIF(PESQ!AL$14:AL$114,RELAT!$B17)))","v":""},{"$f":"IF(AM$14=0,\"\",IF(AM$31<>\"avaliacao\",\"Não se aplica\",COUNTIF(PESQ!AM$14:AM$114,RELAT!$B17)))","v":""},{"$f":"IF(AN$14=0,\"\",IF(AN$31<>\"avaliacao\",\"Não se aplica\",COUNTIF(PESQ!AN$14:AN$114,RELAT!$B17)))","v":""},{"$f":"IF(AO$14=0,\"\",IF(AO$31<>\"avaliacao\",\"Não se aplica\",COUNTIF(PESQ!AO$14:AO$114,RELAT!$B17)))","v":""},{"$f":"IF(AP$14=0,\"\",IF(AP$31<>\"avaliacao\",\"Não se aplica\",COUNTIF(PESQ!AP$14:AP$114,RELAT!$B17)))","v":""},{"$f":"IF(AQ$14=0,\"\",IF(AQ$31<>\"avaliacao\",\"Não se aplica\",COUNTIF(PESQ!AQ$14:AQ$114,RELAT!$B17)))","v":""},{"$f":"IF(AR$14=0,\"\",IF(AR$31<>\"avaliacao\",\"Não se aplica\",COUNTIF(PESQ!AR$14:AR$114,RELAT!$B17)))","v":""},{"$f":"IF(AS$14=0,\"\",IF(AS$31<>\"avaliacao\",\"Não se aplica\",COUNTIF(PESQ!AS$14:AS$114,RELAT!$B17)))","v":""},{"$f":"IF(AT$14=0,\"\",IF(AT$31<>\"avaliacao\",\"Não se aplica\",COUNTIF(PESQ!AT$14:AT$114,RELAT!$B17)))","v":""},{"$f":"IF(AU$14=0,\"\",IF(AU$31<>\"avaliacao\",\"Não se aplica\",COUNTIF(PESQ!AU$14:AU$114,RELAT!$B17)))","v":""},{"$f":"IF(AV$14=0,\"\",IF(AV$31<>\"avaliacao\",\"Não se aplica\",COUNTIF(PESQ!AV$14:AV$114,RELAT!$B17)))","v":""},{"$f":"IF(AW$14=0,\"\",IF(AW$31<>\"avaliacao\",\"Não se aplica\",COUNTIF(PESQ!AW$14:AW$114,RELAT!$B17)))","v":""},{"$f":"IF(AX$14=0,\"\",IF(AX$31<>\"avaliacao\",\"Não se aplica\",COUNTIF(PESQ!AX$14:AX$114,RELAT!$B17)))","v":""},{"$f":"IF(AY$14=0,\"\",IF(AY$31<>\"avaliacao\",\"Não se aplica\",COUNTIF(PESQ!AY$14:AY$114,RELAT!$B17)))","v":""},{"$f":"IF(AZ$14=0,\"\",IF(AZ$31<>\"avaliacao\",\"Não se aplica\",COUNTIF(PESQ!AZ$14:AZ$114,RELAT!$B17)))","v":""}]
[null,"Bom",{"$f":"IF(C$14=0,\"\",IF(C$31<>\"avaliacao\",\"Não se aplica\",COUNTIF(PESQ!C$14:C$114,RELAT!$B18)))","v":"Não se aplica"},{"$f":"IF(D$14=0,\"\",IF(D$31<>\"avaliacao\",\"Não se aplica\",COUNTIF(PESQ!D$14:D$114,RELAT!$B18)))","v":1},{"$f":"IF(E$14=0,\"\",IF(E$31<>\"avaliacao\",\"Não se aplica\",COUNTIF(PESQ!E$14:E$114,RELAT!$B18)))","v":"Não se aplica"},{"$f":"IF(F$14=0,\"\",IF(F$31<>\"avaliacao\",\"Não se aplica\",COUNTIF(PESQ!F$14:F$114,RELAT!$B18)))","v":""},{"$f":"IF(G$14=0,\"\",IF(G$31<>\"avaliacao\",\"Não se aplica\",COUNTIF(PESQ!G$14:G$114,RELAT!$B18)))","v":""},{"$f":"IF(H$14=0,\"\",IF(H$31<>\"avaliacao\",\"Não se aplica\",COUNTIF(PESQ!H$14:H$114,RELAT!$B18)))","v":""},{"$f":"IF(I$14=0,\"\",IF(I$31<>\"avaliacao\",\"Não se aplica\",COUNTIF(PESQ!I$14:I$114,RELAT!$B18)))","v":""},{"$f":"IF(J$14=0,\"\",IF(J$31<>\"avaliacao\",\"Não se aplica\",COUNTIF(PESQ!J$14:J$114,RELAT!$B18)))","v":""},{"$f":"IF(K$14=0,\"\",IF(K$31<>\"avaliacao\",\"Não se aplica\",COUNTIF(PESQ!K$14:K$114,RELAT!$B18)))","v":""},{"$f":"IF(L$14=0,\"\",IF(L$31<>\"avaliacao\",\"Não se aplica\",COUNTIF(PESQ!L$14:L$114,RELAT!$B18)))","v":""},{"$f":"IF(M$14=0,\"\",IF(M$31<>\"avaliacao\",\"Não se aplica\",COUNTIF(PESQ!M$14:M$114,RELAT!$B18)))","v":""},{"$f":"IF(N$14=0,\"\",IF(N$31<>\"avaliacao\",\"Não se aplica\",COUNTIF(PESQ!N$14:N$114,RELAT!$B18)))","v":""},{"$f":"IF(O$14=0,\"\",IF(O$31<>\"avaliacao\",\"Não se aplica\",COUNTIF(PESQ!O$14:O$114,RELAT!$B18)))","v":""},{"$f":"IF(P$14=0,\"\",IF(P$31<>\"avaliacao\",\"Não se aplica\",COUNTIF(PESQ!P$14:P$114,RELAT!$B18)))","v":""},{"$f":"IF(Q$14=0,\"\",IF(Q$31<>\"avaliacao\",\"Não se aplica\",COUNTIF(PESQ!Q$14:Q$114,RELAT!$B18)))","v":""},{"$f":"IF(R$14=0,\"\",IF(R$31<>\"avaliacao\",\"Não se aplica\",COUNTIF(PESQ!R$14:R$114,RELAT!$B18)))","v":""},{"$f":"IF(S$14=0,\"\",IF(S$31<>\"avaliacao\",\"Não se aplica\",COUNTIF(PESQ!S$14:S$114,RELAT!$B18)))","v":""},{"$f":"IF(T$14=0,\"\",IF(T$31<>\"avaliacao\",\"Não se aplica\",COUNTIF(PESQ!T$14:T$114,RELAT!$B18)))","v":""},{"$f":"IF(U$14=0,\"\",IF(U$31<>\"avaliacao\",\"Não se aplica\",COUNTIF(PESQ!U$14:U$114,RELAT!$B18)))","v":""},{"$f":"IF(V$14=0,\"\",IF(V$31<>\"avaliacao\",\"Não se aplica\",COUNTIF(PESQ!V$14:V$114,RELAT!$B18)))","v":""},{"$f":"IF(W$14=0,\"\",IF(W$31<>\"avaliacao\",\"Não se aplica\",COUNTIF(PESQ!W$14:W$114,RELAT!$B18)))","v":""},{"$f":"IF(X$14=0,\"\",IF(X$31<>\"avaliacao\",\"Não se aplica\",COUNTIF(PESQ!X$14:X$114,RELAT!$B18)))","v":""},{"$f":"IF(Y$14=0,\"\",IF(Y$31<>\"avaliacao\",\"Não se aplica\",COUNTIF(PESQ!Y$14:Y$114,RELAT!$B18)))","v":""},{"$f":"IF(Z$14=0,\"\",IF(Z$31<>\"avaliacao\",\"Não se aplica\",COUNTIF(PESQ!Z$14:Z$114,RELAT!$B18)))","v":""},{"$f":"IF(AA$14=0,\"\",IF(AA$31<>\"avaliacao\",\"Não se aplica\",COUNTIF(PESQ!AA$14:AA$114,RELAT!$B18)))","v":""},{"$f":"IF(AB$14=0,\"\",IF(AB$31<>\"avaliacao\",\"Não se aplica\",COUNTIF(PESQ!AB$14:AB$114,RELAT!$B18)))","v":""},{"$f":"IF(AC$14=0,\"\",IF(AC$31<>\"avaliacao\",\"Não se aplica\",COUNTIF(PESQ!AC$14:AC$114,RELAT!$B18)))","v":""},{"$f":"IF(AD$14=0,\"\",IF(AD$31<>\"avaliacao\",\"Não se aplica\",COUNTIF(PESQ!AD$14:AD$114,RELAT!$B18)))","v":""},{"$f":"IF(AE$14=0,\"\",IF(AE$31<>\"avaliacao\",\"Não se aplica\",COUNTIF(PESQ!AE$14:AE$114,RELAT!$B18)))","v":""},{"$f":"IF(AF$14=0,\"\",IF(AF$31<>\"avaliacao\",\"Não se aplica\",COUNTIF(PESQ!AF$14:AF$114,RELAT!$B18)))","v":""},{"$f":"IF(AG$14=0,\"\",IF(AG$31<>\"avaliacao\",\"Não se aplica\",COUNTIF(PESQ!AG$14:AG$114,RELAT!$B18)))","v":""},{"$f":"IF(AH$14=0,\"\",IF(AH$31<>\"avaliacao\",\"Não se aplica\",COUNTIF(PESQ!AH$14:AH$114,RELAT!$B18)))","v":""},{"$f":"IF(AI$14=0,\"\",IF(AI$31<>\"avaliacao\",\"Não se aplica\",COUNTIF(PESQ!AI$14:AI$114,RELAT!$B18)))","v":""},{"$f":"IF(AJ$14=0,\"\",IF(AJ$31<>\"avaliacao\",\"Não se aplica\",COUNTIF(PESQ!AJ$14:AJ$114,RELAT!$B18)))","v":""},{"$f":"IF(AK$14=0,\"\",IF(AK$31<>\"avaliacao\",\"Não se aplica\",COUNTIF(PESQ!AK$14:AK$114,RELAT!$B18)))","v":""},{"$f":"IF(AL$14=0,\"\",IF(AL$31<>\"avaliacao\",\"Não se aplica\",COUNTIF(PESQ!AL$14:AL$114,RELAT!$B18)))","v":""},{"$f":"IF(AM$14=0,\"\",IF(AM$31<>\"avaliacao\",\"Não se aplica\",COUNTIF(PESQ!AM$14:AM$114,RELAT!$B18)))","v":""},{"$f":"IF(AN$14=0,\"\",IF(AN$31<>\"avaliacao\",\"Não se aplica\",COUNTIF(PESQ!AN$14:AN$114,RELAT!$B18)))","v":""},{"$f":"IF(AO$14=0,\"\",IF(AO$31<>\"avaliacao\",\"Não se aplica\",COUNTIF(PESQ!AO$14:AO$114,RELAT!$B18)))","v":""},{"$f":"IF(AP$14=0,\"\",IF(AP$31<>\"avaliacao\",\"Não se aplica\",COUNTIF(PESQ!AP$14:AP$114,RELAT!$B18)))","v":""},{"$f":"IF(AQ$14=0,\"\",IF(AQ$31<>\"avaliacao\",\"Não se aplica\",COUNTIF(PESQ!AQ$14:AQ$114,RELAT!$B18)))","v":""},{"$f":"IF(AR$14=0,\"\",IF(AR$31<>\"avaliacao\",\"Não se aplica\",COUNTIF(PESQ!AR$14:AR$114,RELAT!$B18)))","v":""},{"$f":"IF(AS$14=0,\"\",IF(AS$31<>\"avaliacao\",\"Não se aplica\",COUNTIF(PESQ!AS$14:AS$114,RELAT!$B18)))","v":""},{"$f":"IF(AT$14=0,\"\",IF(AT$31<>\"avaliacao\",\"Não se aplica\",COUNTIF(PESQ!AT$14:AT$114,RELAT!$B18)))","v":""},{"$f":"IF(AU$14=0,\"\",IF(AU$31<>\"avaliacao\",\"Não se aplica\",COUNTIF(PESQ!AU$14:AU$114,RELAT!$B18)))","v":""},{"$f":"IF(AV$14=0,\"\",IF(AV$31<>\"avaliacao\",\"Não se aplica\",COUNTIF(PESQ!AV$14:AV$114,RELAT!$B18)))","v":""},{"$f":"IF(AW$14=0,\"\",IF(AW$31<>\"avaliacao\",\"Não se aplica\",COUNTIF(PESQ!AW$14:AW$114,RELAT!$B18)))","v":""},{"$f":"IF(AX$14=0,\"\",IF(AX$31<>\"avaliacao\",\"Não se aplica\",COUNTIF(PESQ!AX$14:AX$114,RELAT!$B18)))","v":""},{"$f":"IF(AY$14=0,\"\",IF(AY$31<>\"avaliacao\",\"Não se aplica\",COUNTIF(PESQ!AY$14:AY$114,RELAT!$B18)))","v":""},{"$f":"IF(AZ$14=0,\"\",IF(AZ$31<>\"avaliacao\",\"Não se aplica\",COUNTIF(PESQ!AZ$14:AZ$114,RELAT!$B18)))","v":""}]
[null,"Ruim",{"$f":"IF(C$14=0,\"\",IF(C$31<>\"avaliacao\",\"Não se aplica\",COUNTIF(PESQ!C$14:C$114,RELAT!$B19)))","v":"Não se aplica"},{"$f":"IF(D$14=0,\"\",IF(D$31<>\"avaliacao\",\"Não se aplica\",COUNTIF(PESQ!D$14:D$114,RELAT!$B19)))","v":1},{"$f":"IF(E$14=0,\"\",IF(E$31<>\"avaliacao\",\"Não se aplica\",COUNTIF(PESQ!E$14:E$114,RELAT!$B19)))","v":"Não se aplica"},{"$f":"IF(F$14=0,\"\",IF(F$31<>\"avaliacao\",\"Não se aplica\",COUNTIF(PESQ!F$14:F$114,RELAT!$B19)))","v":""},{"$f":"IF(G$14=0,\"\",IF(G$31<>\"avaliacao\",\"Não se aplica\",COUNTIF(PESQ!G$14:G$114,RELAT!$B19)))","v":""},{"$f":"IF(H$14=0,\"\",IF(H$31<>\"avaliacao\",\"Não se aplica\",COUNTIF(PESQ!H$14:H$114,RELAT!$B19)))","v":""},{"$f":"IF(I$14=0,\"\",IF(I$31<>\"avaliacao\",\"Não se aplica\",COUNTIF(PESQ!I$14:I$114,RELAT!$B19)))","v":""},{"$f":"IF(J$14=0,\"\",IF(J$31<>\"avaliacao\",\"Não se aplica\",COUNTIF(PESQ!J$14:J$114,RELAT!$B19)))","v":""},{"$f":"IF(K$14=0,\"\",IF(K$31<>\"avaliacao\",\"Não se aplica\",COUNTIF(PESQ!K$14:K$114,RELAT!$B19)))","v":""},{"$f":"IF(L$14=0,\"\",IF(L$31<>\"avaliacao\",\"Não se aplica\",COUNTIF(PESQ!L$14:L$114,RELAT!$B19)))","v":""},{"$f":"IF(M$14=0,\"\",IF(M$31<>\"avaliacao\",\"Não se aplica\",COUNTIF(PESQ!M$14:M$114,RELAT!$B19)))","v":""},{"$f":"IF(N$14=0,\"\",IF(N$31<>\"avaliacao\",\"Não se aplica\",COUNTIF(PESQ!N$14:N$114,RELAT!$B19)))","v":""},{"$f":"IF(O$14=0,\"\",IF(O$31<>\"avaliacao\",\"Não se aplica\",COUNTIF(PESQ!O$14:O$114,RELAT!$B19)))","v":""},{"$f":"IF(P$14=0,\"\",IF(P$31<>\"avaliacao\",\"Não se aplica\",COUNTIF(PESQ!P$14:P$114,RELAT!$B19)))","v":""},{"$f":"IF(Q$14=0,\"\",IF(Q$31<>\"avaliacao\",\"Não se aplica\",COUNTIF(PESQ!Q$14:Q$114,RELAT!$B19)))","v":""},{"$f":"IF(R$14=0,\"\",IF(R$31<>\"avaliacao\",\"Não se aplica\",COUNTIF(PESQ!R$14:R$114,RELAT!$B19)))","v":""},{"$f":"IF(S$14=0,\"\",IF(S$31<>\"avaliacao\",\"Não se aplica\",COUNTIF(PESQ!S$14:S$114,RELAT!$B19)))","v":""},{"$f":"IF(T$14=0,\"\",IF(T$31<>\"avaliacao\",\"Não se aplica\",COUNTIF(PESQ!T$14:T$114,RELAT!$B19)))","v":""},{"$f":"IF(U$14=0,\"\",IF(U$31<>\"avaliacao\",\"Não se aplica\",COUNTIF(PESQ!U$14:U$114,RELAT!$B19)))","v":""},{"$f":"IF(V$14=0,\"\",IF(V$31<>\"avaliacao\",\"Não se aplica\",COUNTIF(PESQ!V$14:V$114,RELAT!$B19)))","v":""},{"$f":"IF(W$14=0,\"\",IF(W$31<>\"avaliacao\",\"Não se aplica\",COUNTIF(PESQ!W$14:W$114,RELAT!$B19)))","v":""},{"$f":"IF(X$14=0,\"\",IF(X$31<>\"avaliacao\",\"Não se aplica\",COUNTIF(PESQ!X$14:X$114,RELAT!$B19)))","v":""},{"$f":"IF(Y$14=0,\"\",IF(Y$31<>\"avaliacao\",\"Não se aplica\",COUNTIF(PESQ!Y$14:Y$114,RELAT!$B19)))","v":""},{"$f":"IF(Z$14=0,\"\",IF(Z$31<>\"avaliacao\",\"Não se aplica\",COUNTIF(PESQ!Z$14:Z$114,RELAT!$B19)))","v":""},{"$f":"IF(AA$14=0,\"\",IF(AA$31<>\"avaliacao\",\"Não se aplica\",COUNTIF(PESQ!AA$14:AA$114,RELAT!$B19)))","v":""},{"$f":"IF(AB$14=0,\"\",IF(AB$31<>\"avaliacao\",\"Não se aplica\",COUNTIF(PESQ!AB$14:AB$114,RELAT!$B19)))","v":""},{"$f":"IF(AC$14=0,\"\",IF(AC$31<>\"avaliacao\",\"Não se aplica\",COUNTIF(PESQ!AC$14:AC$114,RELAT!$B19)))","v":""},{"$f":"IF(AD$14=0,\"\",IF(AD$31<>\"avaliacao\",\"Não se aplica\",COUNTIF(PESQ!AD$14:AD$114,RELAT!$B19)))","v":""},{"$f":"IF(AE$14=0,\"\",IF(AE$31<>\"avaliacao\",\"Não se aplica\",COUNTIF(PESQ!AE$14:AE$114,RELAT!$B19)))","v":""},{"$f":"IF(AF$14=0,\"\",IF(AF$31<>\"avaliacao\",\"Não se aplica\",COUNTIF(PESQ!AF$14:AF$114,RELAT!$B19)))","v":""},{"$f":"IF(AG$14=0,\"\",IF(AG$31<>\"avaliacao\",\"Não se aplica\",COUNTIF(PESQ!AG$14:AG$114,RELAT!$B19)))","v":""},{"$f":"IF(AH$14=0,\"\",IF(AH$31<>\"avaliacao\",\"Não se aplica\",COUNTIF(PESQ!AH$14:AH$114,RELAT!$B19)))","v":""},{"$f":"IF(AI$14=0,\"\",IF(AI$31<>\"avaliacao\",\"Não se aplica\",COUNTIF(PESQ!AI$14:AI$114,RELAT!$B19)))","v":""},{"$f":"IF(AJ$14=0,\"\",IF(AJ$31<>\"avaliacao\",\"Não se aplica\",COUNTIF(PESQ!AJ$14:AJ$114,RELAT!$B19)))","v":""},{"$f":"IF(AK$14=0,\"\",IF(AK$31<>\"avaliacao\",\"Não se aplica\",COUNTIF(PESQ!AK$14:AK$114,RELAT!$B19)))","v":""},{"$f":"IF(AL$14=0,\"\",IF(AL$31<>\"avaliacao\",\"Não se aplica\",COUNTIF(PESQ!AL$14:AL$114,RELAT!$B19)))","v":""},{"$f":"IF(AM$14=0,\"\",IF(AM$31<>\"avaliacao\",\"Não se aplica\",COUNTIF(PESQ!AM$14:AM$114,RELAT!$B19)))","v":""},{"$f":"IF(AN$14=0,\"\",IF(AN$31<>\"avaliacao\",\"Não se aplica\",COUNTIF(PESQ!AN$14:AN$114,RELAT!$B19)))","v":""},{"$f":"IF(AO$14=0,\"\",IF(AO$31<>\"avaliacao\",\"Não se aplica\",COUNTIF(PESQ!AO$14:AO$114,RELAT!$B19)))","v":""},{"$f":"IF(AP$14=0,\"\",IF(AP$31<>\"avaliacao\",\"Não se aplica\",COUNTIF(PESQ!AP$14:AP$114,RELAT!$B19)))","v":""},{"$f":"IF(AQ$14=0,\"\",IF(AQ$31<>\"avaliacao\",\"Não se aplica\",COUNTIF(PESQ!AQ$14:AQ$114,RELAT!$B19)))","v":""},{"$f":"IF(AR$14=0,\"\",IF(AR$31<>\"avaliacao\",\"Não se aplica\",COUNTIF(PESQ!AR$14:AR$114,RELAT!$B19)))","v":""},{"$f":"IF(AS$14=0,\"\",IF(AS$31<>\"avaliacao\",\"Não se aplica\",COUNTIF(PESQ!AS$14:AS$114,RELAT!$B19)))","v":""},{"$f":"IF(AT$14=0,\"\",IF(AT$31<>\"avaliacao\",\"Não se aplica\",COUNTIF(PESQ!AT$14:AT$114,RELAT!$B19)))","v":""},{"$f":"IF(AU$14=0,\"\",IF(AU$31<>\"avaliacao\",\"Não se aplica\",COUNTIF(PESQ!AU$14:AU$114,RELAT!$B19)))","v":""},{"$f":"IF(AV$14=0,\"\",IF(AV$31<>\"avaliacao\",\"Não se aplica\",COUNTIF(PESQ!AV$14:AV$114,RELAT!$B19)))","v":""},{"$f":"IF(AW$14=0,\"\",IF(AW$31<>\"avaliacao\",\"Não se aplica\",COUNTIF(PESQ!AW$14:AW$114,RELAT!$B19)))","v":""},{"$f":"IF(AX$14=0,\"\",IF(AX$31<>\"avaliacao\",\"Não se aplica\",COUNTIF(PESQ!AX$14:AX$114,RELAT!$B19)))","v":""},{"$f":"IF(AY$14=0,\"\",IF(AY$31<>\"avaliacao\",\"Não se aplica\",COUNTIF(PESQ!AY$14:AY$114,RELAT!$B19)))","v":""},{"$f":"IF(AZ$14=0,\"\",IF(AZ$31<>\"avaliacao\",\"Não se aplica\",COUNTIF(PESQ!AZ$14:AZ$114,RELAT!$B19)))","v":""}]
[null,"Péssimo",{"$f":"IF(C$14=0,\"\",IF(C$31<>\"avaliacao\",\"Não se aplica\",COUNTIF(PESQ!C$14:C$114,RELAT!$B20)))","v":"Não se aplica"},{"$f":"IF(D$14=0,\"\",IF(D$31<>\"avaliacao\",\"Não se aplica\",COUNTIF(PESQ!D$14:D$114,RELAT!$B20)))","v":1},{"$f":"IF(E$14=0,\"\",IF(E$31<>\"avaliacao\",\"Não se aplica\",COUNTIF(PESQ!E$14:E$114,RELAT!$B20)))","v":"Não se aplica"},{"$f":"IF(F$14=0,\"\",IF(F$31<>\"avaliacao\",\"Não se aplica\",COUNTIF(PESQ!F$14:F$114,RELAT!$B20)))","v":""},{"$f":"IF(G$14=0,\"\",IF(G$31<>\"avaliacao\",\"Não se aplica\",COUNTIF(PESQ!G$14:G$114,RELAT!$B20)))","v":""},{"$f":"IF(H$14=0,\"\",IF(H$31<>\"avaliacao\",\"Não se aplica\",COUNTIF(PESQ!H$14:H$114,RELAT!$B20)))","v":""},{"$f":"IF(I$14=0,\"\",IF(I$31<>\"avaliacao\",\"Não se aplica\",COUNTIF(PESQ!I$14:I$114,RELAT!$B20)))","v":""},{"$f":"IF(J$14=0,\"\",IF(J$31<>\"avaliacao\",\"Não se aplica\",COUNTIF(PESQ!J$14:J$114,RELAT!$B20)))","v":""},{"$f":"IF(K$14=0,\"\",IF(K$31<>\"avaliacao\",\"Não se aplica\",COUNTIF(PESQ!K$14:K$114,RELAT!$B20)))","v":""},{"$f":"IF(L$14=0,\"\",IF(L$31<>\"avaliacao\",\"Não se aplica\",COUNTIF(PESQ!L$14:L$114,RELAT!$B20)))","v":""},{"$f":"IF(M$14=0,\"\",IF(M$31<>\"avaliacao\",\"Não se aplica\",COUNTIF(PESQ!M$14:M$114,RELAT!$B20)))","v":""},{"$f":"IF(N$14=0,\"\",IF(N$31<>\"avaliacao\",\"Não se aplica\",COUNTIF(PESQ!N$14:N$114,RELAT!$B20)))","v":""},{"$f":"IF(O$14=0,\"\",IF(O$31<>\"avaliacao\",\"Não se aplica\",COUNTIF(PESQ!O$14:O$114,RELAT!$B20)))","v":""},{"$f":"IF(P$14=0,\"\",IF(P$31<>\"avaliacao\",\"Não se aplica\",COUNTIF(PESQ!P$14:P$114,RELAT!$B20)))","v":""},{"$f":"IF(Q$14=0,\"\",IF(Q$31<>\"avaliacao\",\"Não se aplica\",COUNTIF(PESQ!Q$14:Q$114,RELAT!$B20)))","v":""},{"$f":"IF(R$14=0,\"\",IF(R$31<>\"avaliacao\",\"Não se aplica\",COUNTIF(PESQ!R$14:R$114,RELAT!$B20)))","v":""},{"$f":"IF(S$14=0,\"\",IF(S$31<>\"avaliacao\",\"Não se aplica\",COUNTIF(PESQ!S$14:S$114,RELAT!$B20)))","v":""},{"$f":"IF(T$14=0,\"\",IF(T$31<>\"avaliacao\",\"Não se aplica\",COUNTIF(PESQ!T$14:T$114,RELAT!$B20)))","v":""},{"$f":"IF(U$14=0,\"\",IF(U$31<>\"avaliacao\",\"Não se aplica\",COUNTIF(PESQ!U$14:U$114,RELAT!$B20)))","v":""},{"$f":"IF(V$14=0,\"\",IF(V$31<>\"avaliacao\",\"Não se aplica\",COUNTIF(PESQ!V$14:V$114,RELAT!$B20)))","v":""},{"$f":"IF(W$14=0,\"\",IF(W$31<>\"avaliacao\",\"Não se aplica\",COUNTIF(PESQ!W$14:W$114,RELAT!$B20)))","v":""},{"$f":"IF(X$14=0,\"\",IF(X$31<>\"avaliacao\",\"Não se aplica\",COUNTIF(PESQ!X$14:X$114,RELAT!$B20)))","v":""},{"$f":"IF(Y$14=0,\"\",IF(Y$31<>\"avaliacao\",\"Não se aplica\",COUNTIF(PESQ!Y$14:Y$114,RELAT!$B20)))","v":""},{"$f":"IF(Z$14=0,\"\",IF(Z$31<>\"avaliacao\",\"Não se aplica\",COUNTIF(PESQ!Z$14:Z$114,RELAT!$B20)))","v":""},{"$f":"IF(AA$14=0,\"\",IF(AA$31<>\"avaliacao\",\"Não se aplica\",COUNTIF(PESQ!AA$14:AA$114,RELAT!$B20)))","v":""},{"$f":"IF(AB$14=0,\"\",IF(AB$31<>\"avaliacao\",\"Não se aplica\",COUNTIF(PESQ!AB$14:AB$114,RELAT!$B20)))","v":""},{"$f":"IF(AC$14=0,\"\",IF(AC$31<>\"avaliacao\",\"Não se aplica\",COUNTIF(PESQ!AC$14:AC$114,RELAT!$B20)))","v":""},{"$f":"IF(AD$14=0,\"\",IF(AD$31<>\"avaliacao\",\"Não se aplica\",COUNTIF(PESQ!AD$14:AD$114,RELAT!$B20)))","v":""},{"$f":"IF(AE$14=0,\"\",IF(AE$31<>\"avaliacao\",\"Não se aplica\",COUNTIF(PESQ!AE$14:AE$114,RELAT!$B20)))","v":""},{"$f":"IF(AF$14=0,\"\",IF(AF$31<>\"avaliacao\",\"Não se aplica\",COUNTIF(PESQ!AF$14:AF$114,RELAT!$B20)))","v":""},{"$f":"IF(AG$14=0,\"\",IF(AG$31<>\"avaliacao\",\"Não se aplica\",COUNTIF(PESQ!AG$14:AG$114,RELAT!$B20)))","v":""},{"$f":"IF(AH$14=0,\"\",IF(AH$31<>\"avaliacao\",\"Não se aplica\",COUNTIF(PESQ!AH$14:AH$114,RELAT!$B20)))","v":""},{"$f":"IF(AI$14=0,\"\",IF(AI$31<>\"avaliacao\",\"Não se aplica\",COUNTIF(PESQ!AI$14:AI$114,RELAT!$B20)))","v":""},{"$f":"IF(AJ$14=0,\"\",IF(AJ$31<>\"avaliacao\",\"Não se aplica\",COUNTIF(PESQ!AJ$14:AJ$114,RELAT!$B20)))","v":""},{"$f":"IF(AK$14=0,\"\",IF(AK$31<>\"avaliacao\",\"Não se aplica\",COUNTIF(PESQ!AK$14:AK$114,RELAT!$B20)))","v":""},{"$f":"IF(AL$14=0,\"\",IF(AL$31<>\"avaliacao\",\"Não se aplica\",COUNTIF(PESQ!AL$14:AL$114,RELAT!$B20)))","v":""},{"$f":"IF(AM$14=0,\"\",IF(AM$31<>\"avaliacao\",\"Não se aplica\",COUNTIF(PESQ!AM$14:AM$114,RELAT!$B20)))","v":""},{"$f":"IF(AN$14=0,\"\",IF(AN$31<>\"avaliacao\",\"Não se aplica\",COUNTIF(PESQ!AN$14:AN$114,RELAT!$B20)))","v":""},{"$f":"IF(AO$14=0,\"\",IF(AO$31<>\"avaliacao\",\"Não se aplica\",COUNTIF(PESQ!AO$14:AO$114,RELAT!$B20)))","v":""},{"$f":"IF(AP$14=0,\"\",IF(AP$31<>\"avaliacao\",\"Não se aplica\",COUNTIF(PESQ!AP$14:AP$114,RELAT!$B20)))","v":""},{"$f":"IF(AQ$14=0,\"\",IF(AQ$31<>\"avaliacao\",\"Não se aplica\",COUNTIF(PESQ!AQ$14:AQ$114,RELAT!$B20)))","v":""},{"$f":"IF(AR$14=0,\"\",IF(AR$31<>\"avaliacao\",\"Não se aplica\",COUNTIF(PESQ!AR$14:AR$114,RELAT!$B20)))","v":""},{"$f":"IF(AS$14=0,\"\",IF(AS$31<>\"avaliacao\",\"Não se aplica\",COUNTIF(PESQ!AS$14:AS$114,RELAT!$B20)))","v":""},{"$f":"IF(AT$14=0,\"\",IF(AT$31<>\"avaliacao\",\"Não se aplica\",COUNTIF(PESQ!AT$14:AT$114,RELAT!$B20)))","v":""},{"$f":"IF(AU$14=0,\"\",IF(AU$31<>\"avaliacao\",\"Não se aplica\",COUNTIF(PESQ!AU$14:AU$114,RELAT!$B20)))","v":""},{"$f":"IF(AV$14=0,\"\",IF(AV$31<>\"avaliacao\",\"Não se aplica\",COUNTIF(PESQ!AV$14:AV$114,RELAT!$B20)))","v":""},{"$f":"IF(AW$14=0,\"\",IF(AW$31<>\"avaliacao\",\"Não se aplica\",COUNTIF(PESQ!AW$14:AW$114,RELAT!$B20)))","v":""},{"$f":"IF(AX$14=0,\"\",IF(AX$31<>\"avaliacao\",\"Não se aplica\",COUNTIF(PESQ!AX$14:AX$114,RELAT!$B20)))","v":""},{"$f":"IF(AY$14=0,\"\",IF(AY$31<>\"avaliacao\",\"Não se aplica\",COUNTIF(PESQ!AY$14:AY$114,RELAT!$B20)))","v":""},{"$f":"IF(AZ$14=0,\"\",IF(AZ$31<>\"avaliacao\",\"Não se aplica\",COUNTIF(PESQ!AZ$14:AZ$114,RELAT!$B20)))","v":""}]
[null,1,{"$f":"IF(C$14=0,\"\",IF(C$31<>\"qualit\",\"Não se aplica\",COUNTIF(PESQ!C$14:C$114,RELAT!$B21)))","v":"Não se aplica"},{"$f":"IF(D$14=0,\"\",IF(D$31<>\"qualit\",\"Não se aplica\",COUNTIF(PESQ!D$14:D$114,RELAT!$B21)))","v":"Não se aplica"},{"$f":"IF(E$14=0,\"\",IF(E$31<>\"qualit\",\"Não se aplica\",COUNTIF(PESQ!E$14:E$114,RELAT!$B21)))","v":0},{"$f":"IF(F$14=0,\"\",IF(F$31<>\"qualit\",\"Não se aplica\",COUNTIF(PESQ!F$14:F$114,RELAT!$B21)))","v":""},{"$f":"IF(G$14=0,\"\",IF(G$31<>\"qualit\",\"Não se aplica\",COUNTIF(PESQ!G$14:G$114,RELAT!$B21)))","v":""},{"$f":"IF(H$14=0,\"\",IF(H$31<>\"qualit\",\"Não se aplica\",COUNTIF(PESQ!H$14:H$114,RELAT!$B21)))","v":""},{"$f":"IF(I$14=0,\"\",IF(I$31<>\"qualit\",\"Não se aplica\",COUNTIF(PESQ!I$14:I$114,RELAT!$B21)))","v":""},{"$f":"IF(J$14=0,\"\",IF(J$31<>\"qualit\",\"Não se aplica\",COUNTIF(PESQ!J$14:J$114,RELAT!$B21)))","v":""},{"$f":"IF(K$14=0,\"\",IF(K$31<>\"qualit\",\"Não se aplica\",COUNTIF(PESQ!K$14:K$114,RELAT!$B21)))","v":""},{"$f":"IF(L$14=0,\"\",IF(L$31<>\"qualit\",\"Não se aplica\",COUNTIF(PESQ!L$14:L$114,RELAT!$B21)))","v":""},{"$f":"IF(M$14=0,\"\",IF(M$31<>\"qualit\",\"Não se aplica\",COUNTIF(PESQ!M$14:M$114,RELAT!$B21)))","v":""},{"$f":"IF(N$14=0,\"\",IF(N$31<>\"qualit\",\"Não se aplica\",COUNTIF(PESQ!N$14:N$114,RELAT!$B21)))","v":""},{"$f":"IF(O$14=0,\"\",IF(O$31<>\"qualit\",\"Não se aplica\",COUNTIF(PESQ!O$14:O$114,RELAT!$B21)))","v":""},{"$f":"IF(P$14=0,\"\",IF(P$31<>\"qualit\",\"Não se aplica\",COUNTIF(PESQ!P$14:P$114,RELAT!$B21)))","v":""},{"$f":"IF(Q$14=0,\"\",IF(Q$31<>\"qualit\",\"Não se aplica\",COUNTIF(PESQ!Q$14:Q$114,RELAT!$B21)))","v":""},{"$f":"IF(R$14=0,\"\",IF(R$31<>\"qualit\",\"Não se aplica\",COUNTIF(PESQ!R$14:R$114,RELAT!$B21)))","v":""},{"$f":"IF(S$14=0,\"\",IF(S$31<>\"qualit\",\"Não se aplica\",COUNTIF(PESQ!S$14:S$114,RELAT!$B21)))","v":""},{"$f":"IF(T$14=0,\"\",IF(T$31<>\"qualit\",\"Não se aplica\",COUNTIF(PESQ!T$14:T$114,RELAT!$B21)))","v":""},{"$f":"IF(U$14=0,\"\",IF(U$31<>\"qualit\",\"Não se aplica\",COUNTIF(PESQ!U$14:U$114,RELAT!$B21)))","v":""},{"$f":"IF(V$14=0,\"\",IF(V$31<>\"qualit\",\"Não se aplica\",COUNTIF(PESQ!V$14:V$114,RELAT!$B21)))","v":""},{"$f":"IF(W$14=0,\"\",IF(W$31<>\"qualit\",\"Não se aplica\",COUNTIF(PESQ!W$14:W$114,RELAT!$B21)))","v":""},{"$f":"IF(X$14=0,\"\",IF(X$31<>\"qualit\",\"Não se aplica\",COUNTIF(PESQ!X$14:X$114,RELAT!$B21)))","v":""},{"$f":"IF(Y$14=0,\"\",IF(Y$31<>\"qualit\",\"Não se aplica\",COUNTIF(PESQ!Y$14:Y$114,RELAT!$B21)))","v":""},{"$f":"IF(Z$14=0,\"\",IF(Z$31<>\"qualit\",\"Não se aplica\",COUNTIF(PESQ!Z$14:Z$114,RELAT!$B21)))","v":""},{"$f":"IF(AA$14=0,\"\",IF(AA$31<>\"qualit\",\"Não se aplica\",COUNTIF(PESQ!AA$14:AA$114,RELAT!$B21)))","v":""},{"$f":"IF(AB$14=0,\"\",IF(AB$31<>\"qualit\",\"Não se aplica\",COUNTIF(PESQ!AB$14:AB$114,RELAT!$B21)))","v":""},{"$f":"IF(AC$14=0,\"\",IF(AC$31<>\"qualit\",\"Não se aplica\",COUNTIF(PESQ!AC$14:AC$114,RELAT!$B21)))","v":""},{"$f":"IF(AD$14=0,\"\",IF(AD$31<>\"qualit\",\"Não se aplica\",COUNTIF(PESQ!AD$14:AD$114,RELAT!$B21)))","v":""},{"$f":"IF(AE$14=0,\"\",IF(AE$31<>\"qualit\",\"Não se aplica\",COUNTIF(PESQ!AE$14:AE$114,RELAT!$B21)))","v":""},{"$f":"IF(AF$14=0,\"\",IF(AF$31<>\"qualit\",\"Não se aplica\",COUNTIF(PESQ!AF$14:AF$114,RELAT!$B21)))","v":""},{"$f":"IF(AG$14=0,\"\",IF(AG$31<>\"qualit\",\"Não se aplica\",COUNTIF(PESQ!AG$14:AG$114,RELAT!$B21)))","v":""},{"$f":"IF(AH$14=0,\"\",IF(AH$31<>\"qualit\",\"Não se aplica\",COUNTIF(PESQ!AH$14:AH$114,RELAT!$B21)))","v":""},{"$f":"IF(AI$14=0,\"\",IF(AI$31<>\"qualit\",\"Não se aplica\",COUNTIF(PESQ!AI$14:AI$114,RELAT!$B21)))","v":""},{"$f":"IF(AJ$14=0,\"\",IF(AJ$31<>\"qualit\",\"Não se aplica\",COUNTIF(PESQ!AJ$14:AJ$114,RELAT!$B21)))","v":""},{"$f":"IF(AK$14=0,\"\",IF(AK$31<>\"qualit\",\"Não se aplica\",COUNTIF(PESQ!AK$14:AK$114,RELAT!$B21)))","v":""},{"$f":"IF(AL$14=0,\"\",IF(AL$31<>\"qualit\",\"Não se aplica\",COUNTIF(PESQ!AL$14:AL$114,RELAT!$B21)))","v":""},{"$f":"IF(AM$14=0,\"\",IF(AM$31<>\"qualit\",\"Não se aplica\",COUNTIF(PESQ!AM$14:AM$114,RELAT!$B21)))","v":""},{"$f":"IF(AN$14=0,\"\",IF(AN$31<>\"qualit\",\"Não se aplica\",COUNTIF(PESQ!AN$14:AN$114,RELAT!$B21)))","v":""},{"$f":"IF(AO$14=0,\"\",IF(AO$31<>\"qualit\",\"Não se aplica\",COUNTIF(PESQ!AO$14:AO$114,RELAT!$B21)))","v":""},{"$f":"IF(AP$14=0,\"\",IF(AP$31<>\"qualit\",\"Não se aplica\",COUNTIF(PESQ!AP$14:AP$114,RELAT!$B21)))","v":""},{"$f":"IF(AQ$14=0,\"\",IF(AQ$31<>\"qualit\",\"Não se aplica\",COUNTIF(PESQ!AQ$14:AQ$114,RELAT!$B21)))","v":""},{"$f":"IF(AR$14=0,\"\",IF(AR$31<>\"qualit\",\"Não se aplica\",COUNTIF(PESQ!AR$14:AR$114,RELAT!$B21)))","v":""},{"$f":"IF(AS$14=0,\"\",IF(AS$31<>\"qualit\",\"Não se aplica\",COUNTIF(PESQ!AS$14:AS$114,RELAT!$B21)))","v":""},{"$f":"IF(AT$14=0,\"\",IF(AT$31<>\"qualit\",\"Não se aplica\",COUNTIF(PESQ!AT$14:AT$114,RELAT!$B21)))","v":""},{"$f":"IF(AU$14=0,\"\",IF(AU$31<>\"qualit\",\"Não se aplica\",COUNTIF(PESQ!AU$14:AU$114,RELAT!$B21)))","v":""},{"$f":"IF(AV$14=0,\"\",IF(AV$31<>\"qualit\",\"Não se aplica\",COUNTIF(PESQ!AV$14:AV$114,RELAT!$B21)))","v":""},{"$f":"IF(AW$14=0,\"\",IF(AW$31<>\"qualit\",\"Não se aplica\",COUNTIF(PESQ!AW$14:AW$114,RELAT!$B21)))","v":""},{"$f":"IF(AX$14=0,\"\",IF(AX$31<>\"qualit\",\"Não se aplica\",COUNTIF(PESQ!AX$14:AX$114,RELAT!$B21)))","v":""},{"$f":"IF(AY$14=0,\"\",IF(AY$31<>\"qualit\",\"Não se aplica\",COUNTIF(PESQ!AY$14:AY$114,RELAT!$B21)))","v":""},{"$f":"IF(AZ$14=0,\"\",IF(AZ$31<>\"qualit\",\"Não se aplica\",COUNTIF(PESQ!AZ$14:AZ$114,RELAT!$B21)))","v":""}]
[null,2,{"$f":"IF(C$14=0,\"\",IF(C$31<>\"qualit\",\"Não se aplica\",COUNTIF(PESQ!C$14:C$114,RELAT!$B22)))","v":"Não se aplica"},{"$f":"IF(D$14=0,\"\",IF(D$31<>\"qualit\",\"Não se aplica\",COUNTIF(PESQ!D$14:D$114,RELAT!$B22)))","v":"Não se aplica"},{"$f":"IF(E$14=0,\"\",IF(E$31<>\"qualit\",\"Não se aplica\",COUNTIF(PESQ!E$14:E$114,RELAT!$B22)))","v":2},{"$f":"IF(F$14=0,\"\",IF(F$31<>\"qualit\",\"Não se aplica\",COUNTIF(PESQ!F$14:F$114,RELAT!$B22)))","v":""},{"$f":"IF(G$14=0,\"\",IF(G$31<>\"qualit\",\"Não se aplica\",COUNTIF(PESQ!G$14:G$114,RELAT!$B22)))","v":""},{"$f":"IF(H$14=0,\"\",IF(H$31<>\"qualit\",\"Não se aplica\",COUNTIF(PESQ!H$14:H$114,RELAT!$B22)))","v":""},{"$f":"IF(I$14=0,\"\",IF(I$31<>\"qualit\",\"Não se aplica\",COUNTIF(PESQ!I$14:I$114,RELAT!$B22)))","v":""},{"$f":"IF(J$14=0,\"\",IF(J$31<>\"qualit\",\"Não se aplica\",COUNTIF(PESQ!J$14:J$114,RELAT!$B22)))","v":""},{"$f":"IF(K$14=0,\"\",IF(K$31<>\"qualit\",\"Não se aplica\",COUNTIF(PESQ!K$14:K$114,RELAT!$B22)))","v":""},{"$f":"IF(L$14=0,\"\",IF(L$31<>\"qualit\",\"Não se aplica\",COUNTIF(PESQ!L$14:L$114,RELAT!$B22)))","v":""},{"$f":"IF(M$14=0,\"\",IF(M$31<>\"qualit\",\"Não se aplica\",COUNTIF(PESQ!M$14:M$114,RELAT!$B22)))","v":""},{"$f":"IF(N$14=0,\"\",IF(N$31<>\"qualit\",\"Não se aplica\",COUNTIF(PESQ!N$14:N$114,RELAT!$B22)))","v":""},{"$f":"IF(O$14=0,\"\",IF(O$31<>\"qualit\",\"Não se aplica\",COUNTIF(PESQ!O$14:O$114,RELAT!$B22)))","v":""},{"$f":"IF(P$14=0,\"\",IF(P$31<>\"qualit\",\"Não se aplica\",COUNTIF(PESQ!P$14:P$114,RELAT!$B22)))","v":""},{"$f":"IF(Q$14=0,\"\",IF(Q$31<>\"qualit\",\"Não se aplica\",COUNTIF(PESQ!Q$14:Q$114,RELAT!$B22)))","v":""},{"$f":"IF(R$14=0,\"\",IF(R$31<>\"qualit\",\"Não se aplica\",COUNTIF(PESQ!R$14:R$114,RELAT!$B22)))","v":""},{"$f":"IF(S$14=0,\"\",IF(S$31<>\"qualit\",\"Não se aplica\",COUNTIF(PESQ!S$14:S$114,RELAT!$B22)))","v":""},{"$f":"IF(T$14=0,\"\",IF(T$31<>\"qualit\",\"Não se aplica\",COUNTIF(PESQ!T$14:T$114,RELAT!$B22)))","v":""},{"$f":"IF(U$14=0,\"\",IF(U$31<>\"qualit\",\"Não se aplica\",COUNTIF(PESQ!U$14:U$114,RELAT!$B22)))","v":""},{"$f":"IF(V$14=0,\"\",IF(V$31<>\"qualit\",\"Não se aplica\",COUNTIF(PESQ!V$14:V$114,RELAT!$B22)))","v":""},{"$f":"IF(W$14=0,\"\",IF(W$31<>\"qualit\",\"Não se aplica\",COUNTIF(PESQ!W$14:W$114,RELAT!$B22)))","v":""},{"$f":"IF(X$14=0,\"\",IF(X$31<>\"qualit\",\"Não se aplica\",COUNTIF(PESQ!X$14:X$114,RELAT!$B22)))","v":""},{"$f":"IF(Y$14=0,\"\",IF(Y$31<>\"qualit\",\"Não se aplica\",COUNTIF(PESQ!Y$14:Y$114,RELAT!$B22)))","v":""},{"$f":"IF(Z$14=0,\"\",IF(Z$31<>\"qualit\",\"Não se aplica\",COUNTIF(PESQ!Z$14:Z$114,RELAT!$B22)))","v":""},{"$f":"IF(AA$14=0,\"\",IF(AA$31<>\"qualit\",\"Não se aplica\",COUNTIF(PESQ!AA$14:AA$114,RELAT!$B22)))","v":""},{"$f":"IF(AB$14=0,\"\",IF(AB$31<>\"qualit\",\"Não se aplica\",COUNTIF(PESQ!AB$14:AB$114,RELAT!$B22)))","v":""},{"$f":"IF(AC$14=0,\"\",IF(AC$31<>\"qualit\",\"Não se aplica\",COUNTIF(PESQ!AC$14:AC$114,RELAT!$B22)))","v":""},{"$f":"IF(AD$14=0,\"\",IF(AD$31<>\"qualit\",\"Não se aplica\",COUNTIF(PESQ!AD$14:AD$114,RELAT!$B22)))","v":""},{"$f":"IF(AE$14=0,\"\",IF(AE$31<>\"qualit\",\"Não se aplica\",COUNTIF(PESQ!AE$14:AE$114,RELAT!$B22)))","v":""},{"$f":"IF(AF$14=0,\"\",IF(AF$31<>\"qualit\",\"Não se aplica\",COUNTIF(PESQ!AF$14:AF$114,RELAT!$B22)))","v":""},{"$f":"IF(AG$14=0,\"\",IF(AG$31<>\"qualit\",\"Não se aplica\",COUNTIF(PESQ!AG$14:AG$114,RELAT!$B22)))","v":""},{"$f":"IF(AH$14=0,\"\",IF(AH$31<>\"qualit\",\"Não se aplica\",COUNTIF(PESQ!AH$14:AH$114,RELAT!$B22)))","v":""},{"$f":"IF(AI$14=0,\"\",IF(AI$31<>\"qualit\",\"Não se aplica\",COUNTIF(PESQ!AI$14:AI$114,RELAT!$B22)))","v":""},{"$f":"IF(AJ$14=0,\"\",IF(AJ$31<>\"qualit\",\"Não se aplica\",COUNTIF(PESQ!AJ$14:AJ$114,RELAT!$B22)))","v":""},{"$f":"IF(AK$14=0,\"\",IF(AK$31<>\"qualit\",\"Não se aplica\",COUNTIF(PESQ!AK$14:AK$114,RELAT!$B22)))","v":""},{"$f":"IF(AL$14=0,\"\",IF(AL$31<>\"qualit\",\"Não se aplica\",COUNTIF(PESQ!AL$14:AL$114,RELAT!$B22)))","v":""},{"$f":"IF(AM$14=0,\"\",IF(AM$31<>\"qualit\",\"Não se aplica\",COUNTIF(PESQ!AM$14:AM$114,RELAT!$B22)))","v":""},{"$f":"IF(AN$14=0,\"\",IF(AN$31<>\"qualit\",\"Não se aplica\",COUNTIF(PESQ!AN$14:AN$114,RELAT!$B22)))","v":""},{"$f":"IF(AO$14=0,\"\",IF(AO$31<>\"qualit\",\"Não se aplica\",COUNTIF(PESQ!AO$14:AO$114,RELAT!$B22)))","v":""},{"$f":"IF(AP$14=0,\"\",IF(AP$31<>\"qualit\",\"Não se aplica\",COUNTIF(PESQ!AP$14:AP$114,RELAT!$B22)))","v":""},{"$f":"IF(AQ$14=0,\"\",IF(AQ$31<>\"qualit\",\"Não se aplica\",COUNTIF(PESQ!AQ$14:AQ$114,RELAT!$B22)))","v":""},{"$f":"IF(AR$14=0,\"\",IF(AR$31<>\"qualit\",\"Não se aplica\",COUNTIF(PESQ!AR$14:AR$114,RELAT!$B22)))","v":""},{"$f":"IF(AS$14=0,\"\",IF(AS$31<>\"qualit\",\"Não se aplica\",COUNTIF(PESQ!AS$14:AS$114,RELAT!$B22)))","v":""},{"$f":"IF(AT$14=0,\"\",IF(AT$31<>\"qualit\",\"Não se aplica\",COUNTIF(PESQ!AT$14:AT$114,RELAT!$B22)))","v":""},{"$f":"IF(AU$14=0,\"\",IF(AU$31<>\"qualit\",\"Não se aplica\",COUNTIF(PESQ!AU$14:AU$114,RELAT!$B22)))","v":""},{"$f":"IF(AV$14=0,\"\",IF(AV$31<>\"qualit\",\"Não se aplica\",COUNTIF(PESQ!AV$14:AV$114,RELAT!$B22)))","v":""},{"$f":"IF(AW$14=0,\"\",IF(AW$31<>\"qualit\",\"Não se aplica\",COUNTIF(PESQ!AW$14:AW$114,RELAT!$B22)))","v":""},{"$f":"IF(AX$14=0,\"\",IF(AX$31<>\"qualit\",\"Não se aplica\",COUNTIF(PESQ!AX$14:AX$114,RELAT!$B22)))","v":""},{"$f":"IF(AY$14=0,\"\",IF(AY$31<>\"qualit\",\"Não se aplica\",COUNTIF(PESQ!AY$14:AY$114,RELAT!$B22)))","v":""},{"$f":"IF(AZ$14=0,\"\",IF(AZ$31<>\"qualit\",\"Não se aplica\",COUNTIF(PESQ!AZ$14:AZ$114,RELAT!$B22)))","v":""}]
[null,3,{"$f":"IF(C$14=0,\"\",IF(C$31<>\"qualit\",\"Não se aplica\",COUNTIF(PESQ!C$14:C$114,RELAT!$B23)))","v":"Não se aplica"},{"$f":"IF(D$14=0,\"\",IF(D$31<>\"qualit\",\"Não se aplica\",COUNTIF(PESQ!D$14:D$114,RELAT!$B23)))","v":"Não se aplica"},{"$f":"IF(E$14=0,\"\",IF(E$31<>\"qualit\",\"Não se aplica\",COUNTIF(PESQ!E$14:E$114,RELAT!$B23)))","v":0},{"$f":"IF(F$14=0,\"\",IF(F$31<>\"qualit\",\"Não se aplica\",COUNTIF(PESQ!F$14:F$114,RELAT!$B23)))","v":""},{"$f":"IF(G$14=0,\"\",IF(G$31<>\"qualit\",\"Não se aplica\",COUNTIF(PESQ!G$14:G$114,RELAT!$B23)))","v":""},{"$f":"IF(H$14=0,\"\",IF(H$31<>\"qualit\",\"Não se aplica\",COUNTIF(PESQ!H$14:H$114,RELAT!$B23)))","v":""},{"$f":"IF(I$14=0,\"\",IF(I$31<>\"qualit\",\"Não se aplica\",COUNTIF(PESQ!I$14:I$114,RELAT!$B23)))","v":""},{"$f":"IF(J$14=0,\"\",IF(J$31<>\"qualit\",\"Não se aplica\",COUNTIF(PESQ!J$14:J$114,RELAT!$B23)))","v":""},{"$f":"IF(K$14=0,\"\",IF(K$31<>\"qualit\",\"Não se aplica\",COUNTIF(PESQ!K$14:K$114,RELAT!$B23)))","v":""},{"$f":"IF(L$14=0,\"\",IF(L$31<>\"qualit\",\"Não se aplica\",COUNTIF(PESQ!L$14:L$114,RELAT!$B23)))","v":""},{"$f":"IF(M$14=0,\"\",IF(M$31<>\"qualit\",\"Não se aplica\",COUNTIF(PESQ!M$14:M$114,RELAT!$B23)))","v":""},{"$f":"IF(N$14=0,\"\",IF(N$31<>\"qualit\",\"Não se aplica\",COUNTIF(PESQ!N$14:N$114,RELAT!$B23)))","v":""},{"$f":"IF(O$14=0,\"\",IF(O$31<>\"qualit\",\"Não se aplica\",COUNTIF(PESQ!O$14:O$114,RELAT!$B23)))","v":""},{"$f":"IF(P$14=0,\"\",IF(P$31<>\"qualit\",\"Não se aplica\",COUNTIF(PESQ!P$14:P$114,RELAT!$B23)))","v":""},{"$f":"IF(Q$14=0,\"\",IF(Q$31<>\"qualit\",\"Não se aplica\",COUNTIF(PESQ!Q$14:Q$114,RELAT!$B23)))","v":""},{"$f":"IF(R$14=0,\"\",IF(R$31<>\"qualit\",\"Não se aplica\",COUNTIF(PESQ!R$14:R$114,RELAT!$B23)))","v":""},{"$f":"IF(S$14=0,\"\",IF(S$31<>\"qualit\",\"Não se aplica\",COUNTIF(PESQ!S$14:S$114,RELAT!$B23)))","v":""},{"$f":"IF(T$14=0,\"\",IF(T$31<>\"qualit\",\"Não se aplica\",COUNTIF(PESQ!T$14:T$114,RELAT!$B23)))","v":""},{"$f":"IF(U$14=0,\"\",IF(U$31<>\"qualit\",\"Não se aplica\",COUNTIF(PESQ!U$14:U$114,RELAT!$B23)))","v":""},{"$f":"IF(V$14=0,\"\",IF(V$31<>\"qualit\",\"Não se aplica\",COUNTIF(PESQ!V$14:V$114,RELAT!$B23)))","v":""},{"$f":"IF(W$14=0,\"\",IF(W$31<>\"qualit\",\"Não se aplica\",COUNTIF(PESQ!W$14:W$114,RELAT!$B23)))","v":""},{"$f":"IF(X$14=0,\"\",IF(X$31<>\"qualit\",\"Não se aplica\",COUNTIF(PESQ!X$14:X$114,RELAT!$B23)))","v":""},{"$f":"IF(Y$14=0,\"\",IF(Y$31<>\"qualit\",\"Não se aplica\",COUNTIF(PESQ!Y$14:Y$114,RELAT!$B23)))","v":""},{"$f":"IF(Z$14=0,\"\",IF(Z$31<>\"qualit\",\"Não se aplica\",COUNTIF(PESQ!Z$14:Z$114,RELAT!$B23)))","v":""},{"$f":"IF(AA$14=0,\"\",IF(AA$31<>\"qualit\",\"Não se aplica\",COUNTIF(PESQ!AA$14:AA$114,RELAT!$B23)))","v":""},{"$f":"IF(AB$14=0,\"\",IF(AB$31<>\"qualit\",\"Não se aplica\",COUNTIF(PESQ!AB$14:AB$114,RELAT!$B23)))","v":""},{"$f":"IF(AC$14=0,\"\",IF(AC$31<>\"qualit\",\"Não se aplica\",COUNTIF(PESQ!AC$14:AC$114,RELAT!$B23)))","v":""},{"$f":"IF(AD$14=0,\"\",IF(AD$31<>\"qualit\",\"Não se aplica\",COUNTIF(PESQ!AD$14:AD$114,RELAT!$B23)))","v":""},{"$f":"IF(AE$14=0,\"\",IF(AE$31<>\"qualit\",\"Não se aplica\",COUNTIF(PESQ!AE$14:AE$114,RELAT!$B23)))","v":""},{"$f":"IF(AF$14=0,\"\",IF(AF$31<>\"qualit\",\"Não se aplica\",COUNTIF(PESQ!AF$14:AF$114,RELAT!$B23)))","v":""},{"$f":"IF(AG$14=0,\"\",IF(AG$31<>\"qualit\",\"Não se aplica\",COUNTIF(PESQ!AG$14:AG$114,RELAT!$B23)))","v":""},{"$f":"IF(AH$14=0,\"\",IF(AH$31<>\"qualit\",\"Não se aplica\",COUNTIF(PESQ!AH$14:AH$114,RELAT!$B23)))","v":""},{"$f":"IF(AI$14=0,\"\",IF(AI$31<>\"qualit\",\"Não se aplica\",COUNTIF(PESQ!AI$14:AI$114,RELAT!$B23)))","v":""},{"$f":"IF(AJ$14=0,\"\",IF(AJ$31<>\"qualit\",\"Não se aplica\",COUNTIF(PESQ!AJ$14:AJ$114,RELAT!$B23)))","v":""},{"$f":"IF(AK$14=0,\"\",IF(AK$31<>\"qualit\",\"Não se aplica\",COUNTIF(PESQ!AK$14:AK$114,RELAT!$B23)))","v":""},{"$f":"IF(AL$14=0,\"\",IF(AL$31<>\"qualit\",\"Não se aplica\",COUNTIF(PESQ!AL$14:AL$114,RELAT!$B23)))","v":""},{"$f":"IF(AM$14=0,\"\",IF(AM$31<>\"qualit\",\"Não se aplica\",COUNTIF(PESQ!AM$14:AM$114,RELAT!$B23)))","v":""},{"$f":"IF(AN$14=0,\"\",IF(AN$31<>\"qualit\",\"Não se aplica\",COUNTIF(PESQ!AN$14:AN$114,RELAT!$B23)))","v":""},{"$f":"IF(AO$14=0,\"\",IF(AO$31<>\"qualit\",\"Não se aplica\",COUNTIF(PESQ!AO$14:AO$114,RELAT!$B23)))","v":""},{"$f":"IF(AP$14=0,\"\",IF(AP$31<>\"qualit\",\"Não se aplica\",COUNTIF(PESQ!AP$14:AP$114,RELAT!$B23)))","v":""},{"$f":"IF(AQ$14=0,\"\",IF(AQ$31<>\"qualit\",\"Não se aplica\",COUNTIF(PESQ!AQ$14:AQ$114,RELAT!$B23)))","v":""},{"$f":"IF(AR$14=0,\"\",IF(AR$31<>\"qualit\",\"Não se aplica\",COUNTIF(PESQ!AR$14:AR$114,RELAT!$B23)))","v":""},{"$f":"IF(AS$14=0,\"\",IF(AS$31<>\"qualit\",\"Não se aplica\",COUNTIF(PESQ!AS$14:AS$114,RELAT!$B23)))","v":""},{"$f":"IF(AT$14=0,\"\",IF(AT$31<>\"qualit\",\"Não se aplica\",COUNTIF(PESQ!AT$14:AT$114,RELAT!$B23)))","v":""},{"$f":"IF(AU$14=0,\"\",IF(AU$31<>\"qualit\",\"Não se aplica\",COUNTIF(PESQ!AU$14:AU$114,RELAT!$B23)))","v":""},{"$f":"IF(AV$14=0,\"\",IF(AV$31<>\"qualit\",\"Não se aplica\",COUNTIF(PESQ!AV$14:AV$114,RELAT!$B23)))","v":""},{"$f":"IF(AW$14=0,\"\",IF(AW$31<>\"qualit\",\"Não se aplica\",COUNTIF(PESQ!AW$14:AW$114,RELAT!$B23)))","v":""},{"$f":"IF(AX$14=0,\"\",IF(AX$31<>\"qualit\",\"Não se aplica\",COUNTIF(PESQ!AX$14:AX$114,RELAT!$B23)))","v":""},{"$f":"IF(AY$14=0,\"\",IF(AY$31<>\"qualit\",\"Não se aplica\",COUNTIF(PESQ!AY$14:AY$114,RELAT!$B23)))","v":""},{"$f":"IF(AZ$14=0,\"\",IF(AZ$31<>\"qualit\",\"Não se aplica\",COUNTIF(PESQ!AZ$14:AZ$114,RELAT!$B23)))","v":""}]
[null,4,{"$f":"IF(C$14=0,\"\",IF(C$31<>\"qualit\",\"Não se aplica\",COUNTIF(PESQ!C$14:C$114,RELAT!$B24)))","v":"Não se aplica"},{"$f":"IF(D$14=0,\"\",IF(D$31<>\"qualit\",\"Não se aplica\",COUNTIF(PESQ!D$14:D$114,RELAT!$B24)))","v":"Não se aplica"},{"$f":"IF(E$14=0,\"\",IF(E$31<>\"qualit\",\"Não se aplica\",COUNTIF(PESQ!E$14:E$114,RELAT!$B24)))","v":1},{"$f":"IF(F$14=0,\"\",IF(F$31<>\"qualit\",\"Não se aplica\",COUNTIF(PESQ!F$14:F$114,RELAT!$B24)))","v":""},{"$f":"IF(G$14=0,\"\",IF(G$31<>\"qualit\",\"Não se aplica\",COUNTIF(PESQ!G$14:G$114,RELAT!$B24)))","v":""},{"$f":"IF(H$14=0,\"\",IF(H$31<>\"qualit\",\"Não se aplica\",COUNTIF(PESQ!H$14:H$114,RELAT!$B24)))","v":""},{"$f":"IF(I$14=0,\"\",IF(I$31<>\"qualit\",\"Não se aplica\",COUNTIF(PESQ!I$14:I$114,RELAT!$B24)))","v":""},{"$f":"IF(J$14=0,\"\",IF(J$31<>\"qualit\",\"Não se aplica\",COUNTIF(PESQ!J$14:J$114,RELAT!$B24)))","v":""},{"$f":"IF(K$14=0,\"\",IF(K$31<>\"qualit\",\"Não se aplica\",COUNTIF(PESQ!K$14:K$114,RELAT!$B24)))","v":""},{"$f":"IF(L$14=0,\"\",IF(L$31<>\"qualit\",\"Não se aplica\",COUNTIF(PESQ!L$14:L$114,RELAT!$B24)))","v":""},{"$f":"IF(M$14=0,\"\",IF(M$31<>\"qualit\",\"Não se aplica\",COUNTIF(PESQ!M$14:M$114,RELAT!$B24)))","v":""},{"$f":"IF(N$14=0,\"\",IF(N$31<>\"qualit\",\"Não se aplica\",COUNTIF(PESQ!N$14:N$114,RELAT!$B24)))","v":""},{"$f":"IF(O$14=0,\"\",IF(O$31<>\"qualit\",\"Não se aplica\",COUNTIF(PESQ!O$14:O$114,RELAT!$B24)))","v":""},{"$f":"IF(P$14=0,\"\",IF(P$31<>\"qualit\",\"Não se aplica\",COUNTIF(PESQ!P$14:P$114,RELAT!$B24)))","v":""},{"$f":"IF(Q$14=0,\"\",IF(Q$31<>\"qualit\",\"Não se aplica\",COUNTIF(PESQ!Q$14:Q$114,RELAT!$B24)))","v":""},{"$f":"IF(R$14=0,\"\",IF(R$31<>\"qualit\",\"Não se aplica\",COUNTIF(PESQ!R$14:R$114,RELAT!$B24)))","v":""},{"$f":"IF(S$14=0,\"\",IF(S$31<>\"qualit\",\"Não se aplica\",COUNTIF(PESQ!S$14:S$114,RELAT!$B24)))","v":""},{"$f":"IF(T$14=0,\"\",IF(T$31<>\"qualit\",\"Não se aplica\",COUNTIF(PESQ!T$14:T$114,RELAT!$B24)))","v":""},{"$f":"IF(U$14=0,\"\",IF(U$31<>\"qualit\",\"Não se aplica\",COUNTIF(PESQ!U$14:U$114,RELAT!$B24)))","v":""},{"$f":"IF(V$14=0,\"\",IF(V$31<>\"qualit\",\"Não se aplica\",COUNTIF(PESQ!V$14:V$114,RELAT!$B24)))","v":""},{"$f":"IF(W$14=0,\"\",IF(W$31<>\"qualit\",\"Não se aplica\",COUNTIF(PESQ!W$14:W$114,RELAT!$B24)))","v":""},{"$f":"IF(X$14=0,\"\",IF(X$31<>\"qualit\",\"Não se aplica\",COUNTIF(PESQ!X$14:X$114,RELAT!$B24)))","v":""},{"$f":"IF(Y$14=0,\"\",IF(Y$31<>\"qualit\",\"Não se aplica\",COUNTIF(PESQ!Y$14:Y$114,RELAT!$B24)))","v":""},{"$f":"IF(Z$14=0,\"\",IF(Z$31<>\"qualit\",\"Não se aplica\",COUNTIF(PESQ!Z$14:Z$114,RELAT!$B24)))","v":""},{"$f":"IF(AA$14=0,\"\",IF(AA$31<>\"qualit\",\"Não se aplica\",COUNTIF(PESQ!AA$14:AA$114,RELAT!$B24)))","v":""},{"$f":"IF(AB$14=0,\"\",IF(AB$31<>\"qualit\",\"Não se aplica\",COUNTIF(PESQ!AB$14:AB$114,RELAT!$B24)))","v":""},{"$f":"IF(AC$14=0,\"\",IF(AC$31<>\"qualit\",\"Não se aplica\",COUNTIF(PESQ!AC$14:AC$114,RELAT!$B24)))","v":""},{"$f":"IF(AD$14=0,\"\",IF(AD$31<>\"qualit\",\"Não se aplica\",COUNTIF(PESQ!AD$14:AD$114,RELAT!$B24)))","v":""},{"$f":"IF(AE$14=0,\"\",IF(AE$31<>\"qualit\",\"Não se aplica\",COUNTIF(PESQ!AE$14:AE$114,RELAT!$B24)))","v":""},{"$f":"IF(AF$14=0,\"\",IF(AF$31<>\"qualit\",\"Não se aplica\",COUNTIF(PESQ!AF$14:AF$114,RELAT!$B24)))","v":""},{"$f":"IF(AG$14=0,\"\",IF(AG$31<>\"qualit\",\"Não se aplica\",COUNTIF(PESQ!AG$14:AG$114,RELAT!$B24)))","v":""},{"$f":"IF(AH$14=0,\"\",IF(AH$31<>\"qualit\",\"Não se aplica\",COUNTIF(PESQ!AH$14:AH$114,RELAT!$B24)))","v":""},{"$f":"IF(AI$14=0,\"\",IF(AI$31<>\"qualit\",\"Não se aplica\",COUNTIF(PESQ!AI$14:AI$114,RELAT!$B24)))","v":""},{"$f":"IF(AJ$14=0,\"\",IF(AJ$31<>\"qualit\",\"Não se aplica\",COUNTIF(PESQ!AJ$14:AJ$114,RELAT!$B24)))","v":""},{"$f":"IF(AK$14=0,\"\",IF(AK$31<>\"qualit\",\"Não se aplica\",COUNTIF(PESQ!AK$14:AK$114,RELAT!$B24)))","v":""},{"$f":"IF(AL$14=0,\"\",IF(AL$31<>\"qualit\",\"Não se aplica\",COUNTIF(PESQ!AL$14:AL$114,RELAT!$B24)))","v":""},{"$f":"IF(AM$14=0,\"\",IF(AM$31<>\"qualit\",\"Não se aplica\",COUNTIF(PESQ!AM$14:AM$114,RELAT!$B24)))","v":""},{"$f":"IF(AN$14=0,\"\",IF(AN$31<>\"qualit\",\"Não se aplica\",COUNTIF(PESQ!AN$14:AN$114,RELAT!$B24)))","v":""},{"$f":"IF(AO$14=0,\"\",IF(AO$31<>\"qualit\",\"Não se aplica\",COUNTIF(PESQ!AO$14:AO$114,RELAT!$B24)))","v":""},{"$f":"IF(AP$14=0,\"\",IF(AP$31<>\"qualit\",\"Não se aplica\",COUNTIF(PESQ!AP$14:AP$114,RELAT!$B24)))","v":""},{"$f":"IF(AQ$14=0,\"\",IF(AQ$31<>\"qualit\",\"Não se aplica\",COUNTIF(PESQ!AQ$14:AQ$114,RELAT!$B24)))","v":""},{"$f":"IF(AR$14=0,\"\",IF(AR$31<>\"qualit\",\"Não se aplica\",COUNTIF(PESQ!AR$14:AR$114,RELAT!$B24)))","v":""},{"$f":"IF(AS$14=0,\"\",IF(AS$31<>\"qualit\",\"Não se aplica\",COUNTIF(PESQ!AS$14:AS$114,RELAT!$B24)))","v":""},{"$f":"IF(AT$14=0,\"\",IF(AT$31<>\"qualit\",\"Não se aplica\",COUNTIF(PESQ!AT$14:AT$114,RELAT!$B24)))","v":""},{"$f":"IF(AU$14=0,\"\",IF(AU$31<>\"qualit\",\"Não se aplica\",COUNTIF(PESQ!AU$14:AU$114,RELAT!$B24)))","v":""},{"$f":"IF(AV$14=0,\"\",IF(AV$31<>\"qualit\",\"Não se aplica\",COUNTIF(PESQ!AV$14:AV$114,RELAT!$B24)))","v":""},{"$f":"IF(AW$14=0,\"\",IF(AW$31<>\"qualit\",\"Não se aplica\",COUNTIF(PESQ!AW$14:AW$114,RELAT!$B24)))","v":""},{"$f":"IF(AX$14=0,\"\",IF(AX$31<>\"qualit\",\"Não se aplica\",COUNTIF(PESQ!AX$14:AX$114,RELAT!$B24)))","v":""},{"$f":"IF(AY$14=0,\"\",IF(AY$31<>\"qualit\",\"Não se aplica\",COUNTIF(PESQ!AY$14:AY$114,RELAT!$B24)))","v":""},{"$f":"IF(AZ$14=0,\"\",IF(AZ$31<>\"qualit\",\"Não se aplica\",COUNTIF(PESQ!AZ$14:AZ$114,RELAT!$B24)))","v":""}]
[null,5,{"$f":"IF(C$14=0,\"\",IF(C$31<>\"qualit\",\"Não se aplica\",COUNTIF(PESQ!C$14:C$114,RELAT!$B25)))","v":"Não se aplica"},{"$f":"IF(D$14=0,\"\",IF(D$31<>\"qualit\",\"Não se aplica\",COUNTIF(PESQ!D$14:D$114,RELAT!$B25)))","v":"Não se aplica"},{"$f":"IF(E$14=0,\"\",IF(E$31<>\"qualit\",\"Não se aplica\",COUNTIF(PESQ!E$14:E$114,RELAT!$B25)))","v":1},{"$f":"IF(F$14=0,\"\",IF(F$31<>\"qualit\",\"Não se aplica\",COUNTIF(PESQ!F$14:F$114,RELAT!$B25)))","v":""},{"$f":"IF(G$14=0,\"\",IF(G$31<>\"qualit\",\"Não se aplica\",COUNTIF(PESQ!G$14:G$114,RELAT!$B25)))","v":""},{"$f":"IF(H$14=0,\"\",IF(H$31<>\"qualit\",\"Não se aplica\",COUNTIF(PESQ!H$14:H$114,RELAT!$B25)))","v":""},{"$f":"IF(I$14=0,\"\",IF(I$31<>\"qualit\",\"Não se aplica\",COUNTIF(PESQ!I$14:I$114,RELAT!$B25)))","v":""},{"$f":"IF(J$14=0,\"\",IF(J$31<>\"qualit\",\"Não se aplica\",COUNTIF(PESQ!J$14:J$114,RELAT!$B25)))","v":""},{"$f":"IF(K$14=0,\"\",IF(K$31<>\"qualit\",\"Não se aplica\",COUNTIF(PESQ!K$14:K$114,RELAT!$B25)))","v":""},{"$f":"IF(L$14=0,\"\",IF(L$31<>\"qualit\",\"Não se aplica\",COUNTIF(PESQ!L$14:L$114,RELAT!$B25)))","v":""},{"$f":"IF(M$14=0,\"\",IF(M$31<>\"qualit\",\"Não se aplica\",COUNTIF(PESQ!M$14:M$114,RELAT!$B25)))","v":""},{"$f":"IF(N$14=0,\"\",IF(N$31<>\"qualit\",\"Não se aplica\",COUNTIF(PESQ!N$14:N$114,RELAT!$B25)))","v":""},{"$f":"IF(O$14=0,\"\",IF(O$31<>\"qualit\",\"Não se aplica\",COUNTIF(PESQ!O$14:O$114,RELAT!$B25)))","v":""},{"$f":"IF(P$14=0,\"\",IF(P$31<>\"qualit\",\"Não se aplica\",COUNTIF(PESQ!P$14:P$114,RELAT!$B25)))","v":""},{"$f":"IF(Q$14=0,\"\",IF(Q$31<>\"qualit\",\"Não se aplica\",COUNTIF(PESQ!Q$14:Q$114,RELAT!$B25)))","v":""},{"$f":"IF(R$14=0,\"\",IF(R$31<>\"qualit\",\"Não se aplica\",COUNTIF(PESQ!R$14:R$114,RELAT!$B25)))","v":""},{"$f":"IF(S$14=0,\"\",IF(S$31<>\"qualit\",\"Não se aplica\",COUNTIF(PESQ!S$14:S$114,RELAT!$B25)))","v":""},{"$f":"IF(T$14=0,\"\",IF(T$31<>\"qualit\",\"Não se aplica\",COUNTIF(PESQ!T$14:T$114,RELAT!$B25)))","v":""},{"$f":"IF(U$14=0,\"\",IF(U$31<>\"qualit\",\"Não se aplica\",COUNTIF(PESQ!U$14:U$114,RELAT!$B25)))","v":""},{"$f":"IF(V$14=0,\"\",IF(V$31<>\"qualit\",\"Não se aplica\",COUNTIF(PESQ!V$14:V$114,RELAT!$B25)))","v":""},{"$f":"IF(W$14=0,\"\",IF(W$31<>\"qualit\",\"Não se aplica\",COUNTIF(PESQ!W$14:W$114,RELAT!$B25)))","v":""},{"$f":"IF(X$14=0,\"\",IF(X$31<>\"qualit\",\"Não se aplica\",COUNTIF(PESQ!X$14:X$114,RELAT!$B25)))","v":""},{"$f":"IF(Y$14=0,\"\",IF(Y$31<>\"qualit\",\"Não se aplica\",COUNTIF(PESQ!Y$14:Y$114,RELAT!$B25)))","v":""},{"$f":"IF(Z$14=0,\"\",IF(Z$31<>\"qualit\",\"Não se aplica\",COUNTIF(PESQ!Z$14:Z$114,RELAT!$B25)))","v":""},{"$f":"IF(AA$14=0,\"\",IF(AA$31<>\"qualit\",\"Não se aplica\",COUNTIF(PESQ!AA$14:AA$114,RELAT!$B25)))","v":""},{"$f":"IF(AB$14=0,\"\",IF(AB$31<>\"qualit\",\"Não se aplica\",COUNTIF(PESQ!AB$14:AB$114,RELAT!$B25)))","v":""},{"$f":"IF(AC$14=0,\"\",IF(AC$31<>\"qualit\",\"Não se aplica\",COUNTIF(PESQ!AC$14:AC$114,RELAT!$B25)))","v":""},{"$f":"IF(AD$14=0,\"\",IF(AD$31<>\"qualit\",\"Não se aplica\",COUNTIF(PESQ!AD$14:AD$114,RELAT!$B25)))","v":""},{"$f":"IF(AE$14=0,\"\",IF(AE$31<>\"qualit\",\"Não se aplica\",COUNTIF(PESQ!AE$14:AE$114,RELAT!$B25)))","v":""},{"$f":"IF(AF$14=0,\"\",IF(AF$31<>\"qualit\",\"Não se aplica\",COUNTIF(PESQ!AF$14:AF$114,RELAT!$B25)))","v":""},{"$f":"IF(AG$14=0,\"\",IF(AG$31<>\"qualit\",\"Não se aplica\",COUNTIF(PESQ!AG$14:AG$114,RELAT!$B25)))","v":""},{"$f":"IF(AH$14=0,\"\",IF(AH$31<>\"qualit\",\"Não se aplica\",COUNTIF(PESQ!AH$14:AH$114,RELAT!$B25)))","v":""},{"$f":"IF(AI$14=0,\"\",IF(AI$31<>\"qualit\",\"Não se aplica\",COUNTIF(PESQ!AI$14:AI$114,RELAT!$B25)))","v":""},{"$f":"IF(AJ$14=0,\"\",IF(AJ$31<>\"qualit\",\"Não se aplica\",COUNTIF(PESQ!AJ$14:AJ$114,RELAT!$B25)))","v":""},{"$f":"IF(AK$14=0,\"\",IF(AK$31<>\"qualit\",\"Não se aplica\",COUNTIF(PESQ!AK$14:AK$114,RELAT!$B25)))","v":""},{"$f":"IF(AL$14=0,\"\",IF(AL$31<>\"qualit\",\"Não se aplica\",COUNTIF(PESQ!AL$14:AL$114,RELAT!$B25)))","v":""},{"$f":"IF(AM$14=0,\"\",IF(AM$31<>\"qualit\",\"Não se aplica\",COUNTIF(PESQ!AM$14:AM$114,RELAT!$B25)))","v":""},{"$f":"IF(AN$14=0,\"\",IF(AN$31<>\"qualit\",\"Não se aplica\",COUNTIF(PESQ!AN$14:AN$114,RELAT!$B25)))","v":""},{"$f":"IF(AO$14=0,\"\",IF(AO$31<>\"qualit\",\"Não se aplica\",COUNTIF(PESQ!AO$14:AO$114,RELAT!$B25)))","v":""},{"$f":"IF(AP$14=0,\"\",IF(AP$31<>\"qualit\",\"Não se aplica\",COUNTIF(PESQ!AP$14:AP$114,RELAT!$B25)))","v":""},{"$f":"IF(AQ$14=0,\"\",IF(AQ$31<>\"qualit\",\"Não se aplica\",COUNTIF(PESQ!AQ$14:AQ$114,RELAT!$B25)))","v":""},{"$f":"IF(AR$14=0,\"\",IF(AR$31<>\"qualit\",\"Não se aplica\",COUNTIF(PESQ!AR$14:AR$114,RELAT!$B25)))","v":""},{"$f":"IF(AS$14=0,\"\",IF(AS$31<>\"qualit\",\"Não se aplica\",COUNTIF(PESQ!AS$14:AS$114,RELAT!$B25)))","v":""},{"$f":"IF(AT$14=0,\"\",IF(AT$31<>\"qualit\",\"Não se aplica\",COUNTIF(PESQ!AT$14:AT$114,RELAT!$B25)))","v":""},{"$f":"IF(AU$14=0,\"\",IF(AU$31<>\"qualit\",\"Não se aplica\",COUNTIF(PESQ!AU$14:AU$114,RELAT!$B25)))","v":""},{"$f":"IF(AV$14=0,\"\",IF(AV$31<>\"qualit\",\"Não se aplica\",COUNTIF(PESQ!AV$14:AV$114,RELAT!$B25)))","v":""},{"$f":"IF(AW$14=0,\"\",IF(AW$31<>\"qualit\",\"Não se aplica\",COUNTIF(PESQ!AW$14:AW$114,RELAT!$B25)))","v":""},{"$f":"IF(AX$14=0,\"\",IF(AX$31<>\"qualit\",\"Não se aplica\",COUNTIF(PESQ!AX$14:AX$114,RELAT!$B25)))","v":""},{"$f":"IF(AY$14=0,\"\",IF(AY$31<>\"qualit\",\"Não se aplica\",COUNTIF(PESQ!AY$14:AY$114,RELAT!$B25)))","v":""},{"$f":"IF(AZ$14=0,\"\",IF(AZ$31<>\"qualit\",\"Não se aplica\",COUNTIF(PESQ!AZ$14:AZ$114,RELAT!$B25)))","v":""}]
[null,6,{"$f":"IF(C$14=0,\"\",IF(C$31<>\"qualit\",\"Não se aplica\",COUNTIF(PESQ!C$14:C$114,RELAT!$B26)))","v":"Não se aplica"},{"$f":"IF(D$14=0,\"\",IF(D$31<>\"qualit\",\"Não se aplica\",COUNTIF(PESQ!D$14:D$114,RELAT!$B26)))","v":"Não se aplica"},{"$f":"IF(E$14=0,\"\",IF(E$31<>\"qualit\",\"Não se aplica\",COUNTIF(PESQ!E$14:E$114,RELAT!$B26)))","v":0},{"$f":"IF(F$14=0,\"\",IF(F$31<>\"qualit\",\"Não se aplica\",COUNTIF(PESQ!F$14:F$114,RELAT!$B26)))","v":""},{"$f":"IF(G$14=0,\"\",IF(G$31<>\"qualit\",\"Não se aplica\",COUNTIF(PESQ!G$14:G$114,RELAT!$B26)))","v":""},{"$f":"IF(H$14=0,\"\",IF(H$31<>\"qualit\",\"Não se aplica\",COUNTIF(PESQ!H$14:H$114,RELAT!$B26)))","v":""},{"$f":"IF(I$14=0,\"\",IF(I$31<>\"qualit\",\"Não se aplica\",COUNTIF(PESQ!I$14:I$114,RELAT!$B26)))","v":""},{"$f":"IF(J$14=0,\"\",IF(J$31<>\"qualit\",\"Não se aplica\",COUNTIF(PESQ!J$14:J$114,RELAT!$B26)))","v":""},{"$f":"IF(K$14=0,\"\",IF(K$31<>\"qualit\",\"Não se aplica\",COUNTIF(PESQ!K$14:K$114,RELAT!$B26)))","v":""},{"$f":"IF(L$14=0,\"\",IF(L$31<>\"qualit\",\"Não se aplica\",COUNTIF(PESQ!L$14:L$114,RELAT!$B26)))","v":""},{"$f":"IF(M$14=0,\"\",IF(M$31<>\"qualit\",\"Não se aplica\",COUNTIF(PESQ!M$14:M$114,RELAT!$B26)))","v":""},{"$f":"IF(N$14=0,\"\",IF(N$31<>\"qualit\",\"Não se aplica\",COUNTIF(PESQ!N$14:N$114,RELAT!$B26)))","v":""},{"$f":"IF(O$14=0,\"\",IF(O$31<>\"qualit\",\"Não se aplica\",COUNTIF(PESQ!O$14:O$114,RELAT!$B26)))","v":""},{"$f":"IF(P$14=0,\"\",IF(P$31<>\"qualit\",\"Não se aplica\",COUNTIF(PESQ!P$14:P$114,RELAT!$B26)))","v":""},{"$f":"IF(Q$14=0,\"\",IF(Q$31<>\"qualit\",\"Não se aplica\",COUNTIF(PESQ!Q$14:Q$114,RELAT!$B26)))","v":""},{"$f":"IF(R$14=0,\"\",IF(R$31<>\"qualit\",\"Não se aplica\",COUNTIF(PESQ!R$14:R$114,RELAT!$B26)))","v":""},{"$f":"IF(S$14=0,\"\",IF(S$31<>\"qualit\",\"Não se aplica\",COUNTIF(PESQ!S$14:S$114,RELAT!$B26)))","v":""},{"$f":"IF(T$14=0,\"\",IF(T$31<>\"qualit\",\"Não se aplica\",COUNTIF(PESQ!T$14:T$114,RELAT!$B26)))","v":""},{"$f":"IF(U$14=0,\"\",IF(U$31<>\"qualit\",\"Não se aplica\",COUNTIF(PESQ!U$14:U$114,RELAT!$B26)))","v":""},{"$f":"IF(V$14=0,\"\",IF(V$31<>\"qualit\",\"Não se aplica\",COUNTIF(PESQ!V$14:V$114,RELAT!$B26)))","v":""},{"$f":"IF(W$14=0,\"\",IF(W$31<>\"qualit\",\"Não se aplica\",COUNTIF(PESQ!W$14:W$114,RELAT!$B26)))","v":""},{"$f":"IF(X$14=0,\"\",IF(X$31<>\"qualit\",\"Não se aplica\",COUNTIF(PESQ!X$14:X$114,RELAT!$B26)))","v":""},{"$f":"IF(Y$14=0,\"\",IF(Y$31<>\"qualit\",\"Não se aplica\",COUNTIF(PESQ!Y$14:Y$114,RELAT!$B26)))","v":""},{"$f":"IF(Z$14=0,\"\",IF(Z$31<>\"qualit\",\"Não se aplica\",COUNTIF(PESQ!Z$14:Z$114,RELAT!$B26)))","v":""},{"$f":"IF(AA$14=0,\"\",IF(AA$31<>\"qualit\",\"Não se aplica\",COUNTIF(PESQ!AA$14:AA$114,RELAT!$B26)))","v":""},{"$f":"IF(AB$14=0,\"\",IF(AB$31<>\"qualit\",\"Não se aplica\",COUNTIF(PESQ!AB$14:AB$114,RELAT!$B26)))","v":""},{"$f":"IF(AC$14=0,\"\",IF(AC$31<>\"qualit\",\"Não se aplica\",COUNTIF(PESQ!AC$14:AC$114,RELAT!$B26)))","v":""},{"$f":"IF(AD$14=0,\"\",IF(AD$31<>\"qualit\",\"Não se aplica\",COUNTIF(PESQ!AD$14:AD$114,RELAT!$B26)))","v":""},{"$f":"IF(AE$14=0,\"\",IF(AE$31<>\"qualit\",\"Não se aplica\",COUNTIF(PESQ!AE$14:AE$114,RELAT!$B26)))","v":""},{"$f":"IF(AF$14=0,\"\",IF(AF$31<>\"qualit\",\"Não se aplica\",COUNTIF(PESQ!AF$14:AF$114,RELAT!$B26)))","v":""},{"$f":"IF(AG$14=0,\"\",IF(AG$31<>\"qualit\",\"Não se aplica\",COUNTIF(PESQ!AG$14:AG$114,RELAT!$B26)))","v":""},{"$f":"IF(AH$14=0,\"\",IF(AH$31<>\"qualit\",\"Não se aplica\",COUNTIF(PESQ!AH$14:AH$114,RELAT!$B26)))","v":""},{"$f":"IF(AI$14=0,\"\",IF(AI$31<>\"qualit\",\"Não se aplica\",COUNTIF(PESQ!AI$14:AI$114,RELAT!$B26)))","v":""},{"$f":"IF(AJ$14=0,\"\",IF(AJ$31<>\"qualit\",\"Não se aplica\",COUNTIF(PESQ!AJ$14:AJ$114,RELAT!$B26)))","v":""},{"$f":"IF(AK$14=0,\"\",IF(AK$31<>\"qualit\",\"Não se aplica\",COUNTIF(PESQ!AK$14:AK$114,RELAT!$B26)))","v":""},{"$f":"IF(AL$14=0,\"\",IF(AL$31<>\"qualit\",\"Não se aplica\",COUNTIF(PESQ!AL$14:AL$114,RELAT!$B26)))","v":""},{"$f":"IF(AM$14=0,\"\",IF(AM$31<>\"qualit\",\"Não se aplica\",COUNTIF(PESQ!AM$14:AM$114,RELAT!$B26)))","v":""},{"$f":"IF(AN$14=0,\"\",IF(AN$31<>\"qualit\",\"Não se aplica\",COUNTIF(PESQ!AN$14:AN$114,RELAT!$B26)))","v":""},{"$f":"IF(AO$14=0,\"\",IF(AO$31<>\"qualit\",\"Não se aplica\",COUNTIF(PESQ!AO$14:AO$114,RELAT!$B26)))","v":""},{"$f":"IF(AP$14=0,\"\",IF(AP$31<>\"qualit\",\"Não se aplica\",COUNTIF(PESQ!AP$14:AP$114,RELAT!$B26)))","v":""},{"$f":"IF(AQ$14=0,\"\",IF(AQ$31<>\"qualit\",\"Não se aplica\",COUNTIF(PESQ!AQ$14:AQ$114,RELAT!$B26)))","v":""},{"$f":"IF(AR$14=0,\"\",IF(AR$31<>\"qualit\",\"Não se aplica\",COUNTIF(PESQ!AR$14:AR$114,RELAT!$B26)))","v":""},{"$f":"IF(AS$14=0,\"\",IF(AS$31<>\"qualit\",\"Não se aplica\",COUNTIF(PESQ!AS$14:AS$114,RELAT!$B26)))","v":""},{"$f":"IF(AT$14=0,\"\",IF(AT$31<>\"qualit\",\"Não se aplica\",COUNTIF(PESQ!AT$14:AT$114,RELAT!$B26)))","v":""},{"$f":"IF(AU$14=0,\"\",IF(AU$31<>\"qualit\",\"Não se aplica\",COUNTIF(PESQ!AU$14:AU$114,RELAT!$B26)))","v":""},{"$f":"IF(AV$14=0,\"\",IF(AV$31<>\"qualit\",\"Não se aplica\",COUNTIF(PESQ!AV$14:AV$114,RELAT!$B26)))","v":""},{"$f":"IF(AW$14=0,\"\",IF(AW$31<>\"qualit\",\"Não se aplica\",COUNTIF(PESQ!AW$14:AW$114,RELAT!$B26)))","v":""},{"$f":"IF(AX$14=0,\"\",IF(AX$31<>\"qualit\",\"Não se aplica\",COUNTIF(PESQ!AX$14:AX$114,RELAT!$B26)))","v":""},{"$f":"IF(AY$14=0,\"\",IF(AY$31<>\"qualit\",\"Não se aplica\",COUNTIF(PESQ!AY$14:AY$114,RELAT!$B26)))","v":""},{"$f":"IF(AZ$14=0,\"\",IF(AZ$31<>\"qualit\",\"Não se aplica\",COUNTIF(PESQ!AZ$14:AZ$114,RELAT!$B26)))","v":""}]
[null,7,{"$f":"IF(C$14=0,\"\",IF(C$31<>\"qualit\",\"Não se aplica\",COUNTIF(PESQ!C$14:C$114,RELAT!$B27)))","v":"Não se aplica"},{"$f":"IF(D$14=0,\"\",IF(D$31<>\"qualit\",\"Não se aplica\",COUNTIF(PESQ!D$14:D$114,RELAT!$B27)))","v":"Não se aplica"},{"$f":"IF(E$14=0,\"\",IF(E$31<>\"qualit\",\"Não se aplica\",COUNTIF(PESQ!E$14:E$114,RELAT!$B27)))","v":0},{"$f":"IF(F$14=0,\"\",IF(F$31<>\"qualit\",\"Não se aplica\",COUNTIF(PESQ!F$14:F$114,RELAT!$B27)))","v":""},{"$f":"IF(G$14=0,\"\",IF(G$31<>\"qualit\",\"Não se aplica\",COUNTIF(PESQ!G$14:G$114,RELAT!$B27)))","v":""},{"$f":"IF(H$14=0,\"\",IF(H$31<>\"qualit\",\"Não se aplica\",COUNTIF(PESQ!H$14:H$114,RELAT!$B27)))","v":""},{"$f":"IF(I$14=0,\"\",IF(I$31<>\"qualit\",\"Não se aplica\",COUNTIF(PESQ!I$14:I$114,RELAT!$B27)))","v":""},{"$f":"IF(J$14=0,\"\",IF(J$31<>\"qualit\",\"Não se aplica\",COUNTIF(PESQ!J$14:J$114,RELAT!$B27)))","v":""},{"$f":"IF(K$14=0,\"\",IF(K$31<>\"qualit\",\"Não se aplica\",COUNTIF(PESQ!K$14:K$114,RELAT!$B27)))","v":""},{"$f":"IF(L$14=0,\"\",IF(L$31<>\"qualit\",\"Não se aplica\",COUNTIF(PESQ!L$14:L$114,RELAT!$B27)))","v":""},{"$f":"IF(M$14=0,\"\",IF(M$31<>\"qualit\",\"Não se aplica\",COUNTIF(PESQ!M$14:M$114,RELAT!$B27)))","v":""},{"$f":"IF(N$14=0,\"\",IF(N$31<>\"qualit\",\"Não se aplica\",COUNTIF(PESQ!N$14:N$114,RELAT!$B27)))","v":""},{"$f":"IF(O$14=0,\"\",IF(O$31<>\"qualit\",\"Não se aplica\",COUNTIF(PESQ!O$14:O$114,RELAT!$B27)))","v":""},{"$f":"IF(P$14=0,\"\",IF(P$31<>\"qualit\",\"Não se aplica\",COUNTIF(PESQ!P$14:P$114,RELAT!$B27)))","v":""},{"$f":"IF(Q$14=0,\"\",IF(Q$31<>\"qualit\",\"Não se aplica\",COUNTIF(PESQ!Q$14:Q$114,RELAT!$B27)))","v":""},{"$f":"IF(R$14=0,\"\",IF(R$31<>\"qualit\",\"Não se aplica\",COUNTIF(PESQ!R$14:R$114,RELAT!$B27)))","v":""},{"$f":"IF(S$14=0,\"\",IF(S$31<>\"qualit\",\"Não se aplica\",COUNTIF(PESQ!S$14:S$114,RELAT!$B27)))","v":""},{"$f":"IF(T$14=0,\"\",IF(T$31<>\"qualit\",\"Não se aplica\",COUNTIF(PESQ!T$14:T$114,RELAT!$B27)))","v":""},{"$f":"IF(U$14=0,\"\",IF(U$31<>\"qualit\",\"Não se aplica\",COUNTIF(PESQ!U$14:U$114,RELAT!$B27)))","v":""},{"$f":"IF(V$14=0,\"\",IF(V$31<>\"qualit\",\"Não se aplica\",COUNTIF(PESQ!V$14:V$114,RELAT!$B27)))","v":""},{"$f":"IF(W$14=0,\"\",IF(W$31<>\"qualit\",\"Não se aplica\",COUNTIF(PESQ!W$14:W$114,RELAT!$B27)))","v":""},{"$f":"IF(X$14=0,\"\",IF(X$31<>\"qualit\",\"Não se aplica\",COUNTIF(PESQ!X$14:X$114,RELAT!$B27)))","v":""},{"$f":"IF(Y$14=0,\"\",IF(Y$31<>\"qualit\",\"Não se aplica\",COUNTIF(PESQ!Y$14:Y$114,RELAT!$B27)))","v":""},{"$f":"IF(Z$14=0,\"\",IF(Z$31<>\"qualit\",\"Não se aplica\",COUNTIF(PESQ!Z$14:Z$114,RELAT!$B27)))","v":""},{"$f":"IF(AA$14=0,\"\",IF(AA$31<>\"qualit\",\"Não se aplica\",COUNTIF(PESQ!AA$14:AA$114,RELAT!$B27)))","v":""},{"$f":"IF(AB$14=0,\"\",IF(AB$31<>\"qualit\",\"Não se aplica\",COUNTIF(PESQ!AB$14:AB$114,RELAT!$B27)))","v":""},{"$f":"IF(AC$14=0,\"\",IF(AC$31<>\"qualit\",\"Não se aplica\",COUNTIF(PESQ!AC$14:AC$114,RELAT!$B27)))","v":""},{"$f":"IF(AD$14=0,\"\",IF(AD$31<>\"qualit\",\"Não se aplica\",COUNTIF(PESQ!AD$14:AD$114,RELAT!$B27)))","v":""},{"$f":"IF(AE$14=0,\"\",IF(AE$31<>\"qualit\",\"Não se aplica\",COUNTIF(PESQ!AE$14:AE$114,RELAT!$B27)))","v":""},{"$f":"IF(AF$14=0,\"\",IF(AF$31<>\"qualit\",\"Não se aplica\",COUNTIF(PESQ!AF$14:AF$114,RELAT!$B27)))","v":""},{"$f":"IF(AG$14=0,\"\",IF(AG$31<>\"qualit\",\"Não se aplica\",COUNTIF(PESQ!AG$14:AG$114,RELAT!$B27)))","v":""},{"$f":"IF(AH$14=0,\"\",IF(AH$31<>\"qualit\",\"Não se aplica\",COUNTIF(PESQ!AH$14:AH$114,RELAT!$B27)))","v":""},{"$f":"IF(AI$14=0,\"\",IF(AI$31<>\"qualit\",\"Não se aplica\",COUNTIF(PESQ!AI$14:AI$114,RELAT!$B27)))","v":""},{"$f":"IF(AJ$14=0,\"\",IF(AJ$31<>\"qualit\",\"Não se aplica\",COUNTIF(PESQ!AJ$14:AJ$114,RELAT!$B27)))","v":""},{"$f":"IF(AK$14=0,\"\",IF(AK$31<>\"qualit\",\"Não se aplica\",COUNTIF(PESQ!AK$14:AK$114,RELAT!$B27)))","v":""},{"$f":"IF(AL$14=0,\"\",IF(AL$31<>\"qualit\",\"Não se aplica\",COUNTIF(PESQ!AL$14:AL$114,RELAT!$B27)))","v":""},{"$f":"IF(AM$14=0,\"\",IF(AM$31<>\"qualit\",\"Não se aplica\",COUNTIF(PESQ!AM$14:AM$114,RELAT!$B27)))","v":""},{"$f":"IF(AN$14=0,\"\",IF(AN$31<>\"qualit\",\"Não se aplica\",COUNTIF(PESQ!AN$14:AN$114,RELAT!$B27)))","v":""},{"$f":"IF(AO$14=0,\"\",IF(AO$31<>\"qualit\",\"Não se aplica\",COUNTIF(PESQ!AO$14:AO$114,RELAT!$B27)))","v":""},{"$f":"IF(AP$14=0,\"\",IF(AP$31<>\"qualit\",\"Não se aplica\",COUNTIF(PESQ!AP$14:AP$114,RELAT!$B27)))","v":""},{"$f":"IF(AQ$14=0,\"\",IF(AQ$31<>\"qualit\",\"Não se aplica\",COUNTIF(PESQ!AQ$14:AQ$114,RELAT!$B27)))","v":""},{"$f":"IF(AR$14=0,\"\",IF(AR$31<>\"qualit\",\"Não se aplica\",COUNTIF(PESQ!AR$14:AR$114,RELAT!$B27)))","v":""},{"$f":"IF(AS$14=0,\"\",IF(AS$31<>\"qualit\",\"Não se aplica\",COUNTIF(PESQ!AS$14:AS$114,RELAT!$B27)))","v":""},{"$f":"IF(AT$14=0,\"\",IF(AT$31<>\"qualit\",\"Não se aplica\",COUNTIF(PESQ!AT$14:AT$114,RELAT!$B27)))","v":""},{"$f":"IF(AU$14=0,\"\",IF(AU$31<>\"qualit\",\"Não se aplica\",COUNTIF(PESQ!AU$14:AU$114,RELAT!$B27)))","v":""},{"$f":"IF(AV$14=0,\"\",IF(AV$31<>\"qualit\",\"Não se aplica\",COUNTIF(PESQ!AV$14:AV$114,RELAT!$B27)))","v":""},{"$f":"IF(AW$14=0,\"\",IF(AW$31<>\"qualit\",\"Não se aplica\",COUNTIF(PESQ!AW$14:AW$114,RELAT!$B27)))","v":""},{"$f":"IF(AX$14=0,\"\",IF(AX$31<>\"qualit\",\"Não se aplica\",COUNTIF(PESQ!AX$14:AX$114,RELAT!$B27)))","v":""},{"$f":"IF(AY$14=0,\"\",IF(AY$31<>\"qualit\",\"Não se aplica\",COUNTIF(PESQ!AY$14:AY$114,RELAT!$B27)))","v":""},{"$f":"IF(AZ$14=0,\"\",IF(AZ$31<>\"qualit\",\"Não se aplica\",COUNTIF(PESQ!AZ$14:AZ$114,RELAT!$B27)))","v":""}]
[null,8,{"$f":"IF(C$14=0,\"\",IF(C$31<>\"qualit\",\"Não se aplica\",COUNTIF(PESQ!C$14:C$114,RELAT!$B28)))","v":"Não se aplica"},{"$f":"IF(D$14=0,\"\",IF(D$31<>\"qualit\",\"Não se aplica\",COUNTIF(PESQ!D$14:D$114,RELAT!$B28)))","v":"Não se aplica"},{"$f":"IF(E$14=0,\"\",IF(E$31<>\"qualit\",\"Não se aplica\",COUNTIF(PESQ!E$14:E$114,RELAT!$B28)))","v":0},{"$f":"IF(F$14=0,\"\",IF(F$31<>\"qualit\",\"Não se aplica\",COUNTIF(PESQ!F$14:F$114,RELAT!$B28)))","v":""},{"$f":"IF(G$14=0,\"\",IF(G$31<>\"qualit\",\"Não se aplica\",COUNTIF(PESQ!G$14:G$114,RELAT!$B28)))","v":""},{"$f":"IF(H$14=0,\"\",IF(H$31<>\"qualit\",\"Não se aplica\",COUNTIF(PESQ!H$14:H$114,RELAT!$B28)))","v":""},{"$f":"IF(I$14=0,\"\",IF(I$31<>\"qualit\",\"Não se aplica\",COUNTIF(PESQ!I$14:I$114,RELAT!$B28)))","v":""},{"$f":"IF(J$14=0,\"\",IF(J$31<>\"qualit\",\"Não se aplica\",COUNTIF(PESQ!J$14:J$114,RELAT!$B28)))","v":""},{"$f":"IF(K$14=0,\"\",IF(K$31<>\"qualit\",\"Não se aplica\",COUNTIF(PESQ!K$14:K$114,RELAT!$B28)))","v":""},{"$f":"IF(L$14=0,\"\",IF(L$31<>\"qualit\",\"Não se aplica\",COUNTIF(PESQ!L$14:L$114,RELAT!$B28)))","v":""},{"$f":"IF(M$14=0,\"\",IF(M$31<>\"qualit\",\"Não se aplica\",COUNTIF(PESQ!M$14:M$114,RELAT!$B28)))","v":""},{"$f":"IF(N$14=0,\"\",IF(N$31<>\"qualit\",\"Não se aplica\",COUNTIF(PESQ!N$14:N$114,RELAT!$B28)))","v":""},{"$f":"IF(O$14=0,\"\",IF(O$31<>\"qualit\",\"Não se aplica\",COUNTIF(PESQ!O$14:O$114,RELAT!$B28)))","v":""},{"$f":"IF(P$14=0,\"\",IF(P$31<>\"qualit\",\"Não se aplica\",COUNTIF(PESQ!P$14:P$114,RELAT!$B28)))","v":""},{"$f":"IF(Q$14=0,\"\",IF(Q$31<>\"qualit\",\"Não se aplica\",COUNTIF(PESQ!Q$14:Q$114,RELAT!$B28)))","v":""},{"$f":"IF(R$14=0,\"\",IF(R$31<>\"qualit\",\"Não se aplica\",COUNTIF(PESQ!R$14:R$114,RELAT!$B28)))","v":""},{"$f":"IF(S$14=0,\"\",IF(S$31<>\"qualit\",\"Não se aplica\",COUNTIF(PESQ!S$14:S$114,RELAT!$B28)))","v":""},{"$f":"IF(T$14=0,\"\",IF(T$31<>\"qualit\",\"Não se aplica\",COUNTIF(PESQ!T$14:T$114,RELAT!$B28)))","v":""},{"$f":"IF(U$14=0,\"\",IF(U$31<>\"qualit\",\"Não se aplica\",COUNTIF(PESQ!U$14:U$114,RELAT!$B28)))","v":""},{"$f":"IF(V$14=0,\"\",IF(V$31<>\"qualit\",\"Não se aplica\",COUNTIF(PESQ!V$14:V$114,RELAT!$B28)))","v":""},{"$f":"IF(W$14=0,\"\",IF(W$31<>\"qualit\",\"Não se aplica\",COUNTIF(PESQ!W$14:W$114,RELAT!$B28)))","v":""},{"$f":"IF(X$14=0,\"\",IF(X$31<>\"qualit\",\"Não se aplica\",COUNTIF(PESQ!X$14:X$114,RELAT!$B28)))","v":""},{"$f":"IF(Y$14=0,\"\",IF(Y$31<>\"qualit\",\"Não se aplica\",COUNTIF(PESQ!Y$14:Y$114,RELAT!$B28)))","v":""},{"$f":"IF(Z$14=0,\"\",IF(Z$31<>\"qualit\",\"Não se aplica\",COUNTIF(PESQ!Z$14:Z$114,RELAT!$B28)))","v":""},{"$f":"IF(AA$14=0,\"\",IF(AA$31<>\"qualit\",\"Não se aplica\",COUNTIF(PESQ!AA$14:AA$114,RELAT!$B28)))","v":""},{"$f":"IF(AB$14=0,\"\",IF(AB$31<>\"qualit\",\"Não se aplica\",COUNTIF(PESQ!AB$14:AB$114,RELAT!$B28)))","v":""},{"$f":"IF(AC$14=0,\"\",IF(AC$31<>\"qualit\",\"Não se aplica\",COUNTIF(PESQ!AC$14:AC$114,RELAT!$B28)))","v":""},{"$f":"IF(AD$14=0,\"\",IF(AD$31<>\"qualit\",\"Não se aplica\",COUNTIF(PESQ!AD$14:AD$114,RELAT!$B28)))","v":""},{"$f":"IF(AE$14=0,\"\",IF(AE$31<>\"qualit\",\"Não se aplica\",COUNTIF(PESQ!AE$14:AE$114,RELAT!$B28)))","v":""},{"$f":"IF(AF$14=0,\"\",IF(AF$31<>\"qualit\",\"Não se aplica\",COUNTIF(PESQ!AF$14:AF$114,RELAT!$B28)))","v":""},{"$f":"IF(AG$14=0,\"\",IF(AG$31<>\"qualit\",\"Não se aplica\",COUNTIF(PESQ!AG$14:AG$114,RELAT!$B28)))","v":""},{"$f":"IF(AH$14=0,\"\",IF(AH$31<>\"qualit\",\"Não se aplica\",COUNTIF(PESQ!AH$14:AH$114,RELAT!$B28)))","v":""},{"$f":"IF(AI$14=0,\"\",IF(AI$31<>\"qualit\",\"Não se aplica\",COUNTIF(PESQ!AI$14:AI$114,RELAT!$B28)))","v":""},{"$f":"IF(AJ$14=0,\"\",IF(AJ$31<>\"qualit\",\"Não se aplica\",COUNTIF(PESQ!AJ$14:AJ$114,RELAT!$B28)))","v":""},{"$f":"IF(AK$14=0,\"\",IF(AK$31<>\"qualit\",\"Não se aplica\",COUNTIF(PESQ!AK$14:AK$114,RELAT!$B28)))","v":""},{"$f":"IF(AL$14=0,\"\",IF(AL$31<>\"qualit\",\"Não se aplica\",COUNTIF(PESQ!AL$14:AL$114,RELAT!$B28)))","v":""},{"$f":"IF(AM$14=0,\"\",IF(AM$31<>\"qualit\",\"Não se aplica\",COUNTIF(PESQ!AM$14:AM$114,RELAT!$B28)))","v":""},{"$f":"IF(AN$14=0,\"\",IF(AN$31<>\"qualit\",\"Não se aplica\",COUNTIF(PESQ!AN$14:AN$114,RELAT!$B28)))","v":""},{"$f":"IF(AO$14=0,\"\",IF(AO$31<>\"qualit\",\"Não se aplica\",COUNTIF(PESQ!AO$14:AO$114,RELAT!$B28)))","v":""},{"$f":"IF(AP$14=0,\"\",IF(AP$31<>\"qualit\",\"Não se aplica\",COUNTIF(PESQ!AP$14:AP$114,RELAT!$B28)))","v":""},{"$f":"IF(AQ$14=0,\"\",IF(AQ$31<>\"qualit\",\"Não se aplica\",COUNTIF(PESQ!AQ$14:AQ$114,RELAT!$B28)))","v":""},{"$f":"IF(AR$14=0,\"\",IF(AR$31<>\"qualit\",\"Não se aplica\",COUNTIF(PESQ!AR$14:AR$114,RELAT!$B28)))","v":""},{"$f":"IF(AS$14=0,\"\",IF(AS$31<>\"qualit\",\"Não se aplica\",COUNTIF(PESQ!AS$14:AS$114,RELAT!$B28)))","v":""},{"$f":"IF(AT$14=0,\"\",IF(AT$31<>\"qualit\",\"Não se aplica\",COUNTIF(PESQ!AT$14:AT$114,RELAT!$B28)))","v":""},{"$f":"IF(AU$14=0,\"\",IF(AU$31<>\"qualit\",\"Não se aplica\",COUNTIF(PESQ!AU$14:AU$114,RELAT!$B28)))","v":""},{"$f":"IF(AV$14=0,\"\",IF(AV$31<>\"qualit\",\"Não se aplica\",COUNTIF(PESQ!AV$14:AV$114,RELAT!$B28)))","v":""},{"$f":"IF(AW$14=0,\"\",IF(AW$31<>\"qualit\",\"Não se aplica\",COUNTIF(PESQ!AW$14:AW$114,RELAT!$B28)))","v":""},{"$f":"IF(AX$14=0,\"\",IF(AX$31<>\"qualit\",\"Não se aplica\",COUNTIF(PESQ!AX$14:AX$114,RELAT!$B28)))","v":""},{"$f":"IF(AY$14=0,\"\",IF(AY$31<>\"qualit\",\"Não se aplica\",COUNTIF(PESQ!AY$14:AY$114,RELAT!$B28)))","v":""},{"$f":"IF(AZ$14=0,\"\",IF(AZ$31<>\"qualit\",\"Não se aplica\",COUNTIF(PESQ!AZ$14:AZ$114,RELAT!$B28)))","v":""}]
[null,9,{"$f":"IF(C$14=0,\"\",IF(C$31<>\"qualit\",\"Não se aplica\",COUNTIF(PESQ!C$14:C$114,RELAT!$B29)))","v":"Não se aplica"},{"$f":"IF(D$14=0,\"\",IF(D$31<>\"qualit\",\"Não se aplica\",COUNTIF(PESQ!D$14:D$114,RELAT!$B29)))","v":"Não se aplica"},{"$f":"IF(E$14=0,\"\",IF(E$31<>\"qualit\",\"Não se aplica\",COUNTIF(PESQ!E$14:E$114,RELAT!$B29)))","v":0},{"$f":"IF(F$14=0,\"\",IF(F$31<>\"qualit\",\"Não se aplica\",COUNTIF(PESQ!F$14:F$114,RELAT!$B29)))","v":""},{"$f":"IF(G$14=0,\"\",IF(G$31<>\"qualit\",\"Não se aplica\",COUNTIF(PESQ!G$14:G$114,RELAT!$B29)))","v":""},{"$f":"IF(H$14=0,\"\",IF(H$31<>\"qualit\",\"Não se aplica\",COUNTIF(PESQ!H$14:H$114,RELAT!$B29)))","v":""},{"$f":"IF(I$14=0,\"\",IF(I$31<>\"qualit\",\"Não se aplica\",COUNTIF(PESQ!I$14:I$114,RELAT!$B29)))","v":""},{"$f":"IF(J$14=0,\"\",IF(J$31<>\"qualit\",\"Não se aplica\",COUNTIF(PESQ!J$14:J$114,RELAT!$B29)))","v":""},{"$f":"IF(K$14=0,\"\",IF(K$31<>\"qualit\",\"Não se aplica\",COUNTIF(PESQ!K$14:K$114,RELAT!$B29)))","v":""},{"$f":"IF(L$14=0,\"\",IF(L$31<>\"qualit\",\"Não se aplica\",COUNTIF(PESQ!L$14:L$114,RELAT!$B29)))","v":""},{"$f":"IF(M$14=0,\"\",IF(M$31<>\"qualit\",\"Não se aplica\",COUNTIF(PESQ!M$14:M$114,RELAT!$B29)))","v":""},{"$f":"IF(N$14=0,\"\",IF(N$31<>\"qualit\",\"Não se aplica\",COUNTIF(PESQ!N$14:N$114,RELAT!$B29)))","v":""},{"$f":"IF(O$14=0,\"\",IF(O$31<>\"qualit\",\"Não se aplica\",COUNTIF(PESQ!O$14:O$114,RELAT!$B29)))","v":""},{"$f":"IF(P$14=0,\"\",IF(P$31<>\"qualit\",\"Não se aplica\",COUNTIF(PESQ!P$14:P$114,RELAT!$B29)))","v":""},{"$f":"IF(Q$14=0,\"\",IF(Q$31<>\"qualit\",\"Não se aplica\",COUNTIF(PESQ!Q$14:Q$114,RELAT!$B29)))","v":""},{"$f":"IF(R$14=0,\"\",IF(R$31<>\"qualit\",\"Não se aplica\",COUNTIF(PESQ!R$14:R$114,RELAT!$B29)))","v":""},{"$f":"IF(S$14=0,\"\",IF(S$31<>\"qualit\",\"Não se aplica\",COUNTIF(PESQ!S$14:S$114,RELAT!$B29)))","v":""},{"$f":"IF(T$14=0,\"\",IF(T$31<>\"qualit\",\"Não se aplica\",COUNTIF(PESQ!T$14:T$114,RELAT!$B29)))","v":""},{"$f":"IF(U$14=0,\"\",IF(U$31<>\"qualit\",\"Não se aplica\",COUNTIF(PESQ!U$14:U$114,RELAT!$B29)))","v":""},{"$f":"IF(V$14=0,\"\",IF(V$31<>\"qualit\",\"Não se aplica\",COUNTIF(PESQ!V$14:V$114,RELAT!$B29)))","v":""},{"$f":"IF(W$14=0,\"\",IF(W$31<>\"qualit\",\"Não se aplica\",COUNTIF(PESQ!W$14:W$114,RELAT!$B29)))","v":""},{"$f":"IF(X$14=0,\"\",IF(X$31<>\"qualit\",\"Não se aplica\",COUNTIF(PESQ!X$14:X$114,RELAT!$B29)))","v":""},{"$f":"IF(Y$14=0,\"\",IF(Y$31<>\"qualit\",\"Não se aplica\",COUNTIF(PESQ!Y$14:Y$114,RELAT!$B29)))","v":""},{"$f":"IF(Z$14=0,\"\",IF(Z$31<>\"qualit\",\"Não se aplica\",COUNTIF(PESQ!Z$14:Z$114,RELAT!$B29)))","v":""},{"$f":"IF(AA$14=0,\"\",IF(AA$31<>\"qualit\",\"Não se aplica\",COUNTIF(PESQ!AA$14:AA$114,RELAT!$B29)))","v":""},{"$f":"IF(AB$14=0,\"\",IF(AB$31<>\"qualit\",\"Não se aplica\",COUNTIF(PESQ!AB$14:AB$114,RELAT!$B29)))","v":""},{"$f":"IF(AC$14=0,\"\",IF(AC$31<>\"qualit\",\"Não se aplica\",COUNTIF(PESQ!AC$14:AC$114,RELAT!$B29)))","v":""},{"$f":"IF(AD$14=0,\"\",IF(AD$31<>\"qualit\",\"Não se aplica\",COUNTIF(PESQ!AD$14:AD$114,RELAT!$B29)))","v":""},{"$f":"IF(AE$14=0,\"\",IF(AE$31<>\"qualit\",\"Não se aplica\",COUNTIF(PESQ!AE$14:AE$114,RELAT!$B29)))","v":""},{"$f":"IF(AF$14=0,\"\",IF(AF$31<>\"qualit\",\"Não se aplica\",COUNTIF(PESQ!AF$14:AF$114,RELAT!$B29)))","v":""},{"$f":"IF(AG$14=0,\"\",IF(AG$31<>\"qualit\",\"Não se aplica\",COUNTIF(PESQ!AG$14:AG$114,RELAT!$B29)))","v":""},{"$f":"IF(AH$14=0,\"\",IF(AH$31<>\"qualit\",\"Não se aplica\",COUNTIF(PESQ!AH$14:AH$114,RELAT!$B29)))","v":""},{"$f":"IF(AI$14=0,\"\",IF(AI$31<>\"qualit\",\"Não se aplica\",COUNTIF(PESQ!AI$14:AI$114,RELAT!$B29)))","v":""},{"$f":"IF(AJ$14=0,\"\",IF(AJ$31<>\"qualit\",\"Não se aplica\",COUNTIF(PESQ!AJ$14:AJ$114,RELAT!$B29)))","v":""},{"$f":"IF(AK$14=0,\"\",IF(AK$31<>\"qualit\",\"Não se aplica\",COUNTIF(PESQ!AK$14:AK$114,RELAT!$B29)))","v":""},{"$f":"IF(AL$14=0,\"\",IF(AL$31<>\"qualit\",\"Não se aplica\",COUNTIF(PESQ!AL$14:AL$114,RELAT!$B29)))","v":""},{"$f":"IF(AM$14=0,\"\",IF(AM$31<>\"qualit\",\"Não se aplica\",COUNTIF(PESQ!AM$14:AM$114,RELAT!$B29)))","v":""},{"$f":"IF(AN$14=0,\"\",IF(AN$31<>\"qualit\",\"Não se aplica\",COUNTIF(PESQ!AN$14:AN$114,RELAT!$B29)))","v":""},{"$f":"IF(AO$14=0,\"\",IF(AO$31<>\"qualit\",\"Não se aplica\",COUNTIF(PESQ!AO$14:AO$114,RELAT!$B29)))","v":""},{"$f":"IF(AP$14=0,\"\",IF(AP$31<>\"qualit\",\"Não se aplica\",COUNTIF(PESQ!AP$14:AP$114,RELAT!$B29)))","v":""},{"$f":"IF(AQ$14=0,\"\",IF(AQ$31<>\"qualit\",\"Não se aplica\",COUNTIF(PESQ!AQ$14:AQ$114,RELAT!$B29)))","v":""},{"$f":"IF(AR$14=0,\"\",IF(AR$31<>\"qualit\",\"Não se aplica\",COUNTIF(PESQ!AR$14:AR$114,RELAT!$B29)))","v":""},{"$f":"IF(AS$14=0,\"\",IF(AS$31<>\"qualit\",\"Não se aplica\",COUNTIF(PESQ!AS$14:AS$114,RELAT!$B29)))","v":""},{"$f":"IF(AT$14=0,\"\",IF(AT$31<>\"qualit\",\"Não se aplica\",COUNTIF(PESQ!AT$14:AT$114,RELAT!$B29)))","v":""},{"$f":"IF(AU$14=0,\"\",IF(AU$31<>\"qualit\",\"Não se aplica\",COUNTIF(PESQ!AU$14:AU$114,RELAT!$B29)))","v":""},{"$f":"IF(AV$14=0,\"\",IF(AV$31<>\"qualit\",\"Não se aplica\",COUNTIF(PESQ!AV$14:AV$114,RELAT!$B29)))","v":""},{"$f":"IF(AW$14=0,\"\",IF(AW$31<>\"qualit\",\"Não se aplica\",COUNTIF(PESQ!AW$14:AW$114,RELAT!$B29)))","v":""},{"$f":"IF(AX$14=0,\"\",IF(AX$31<>\"qualit\",\"Não se aplica\",COUNTIF(PESQ!AX$14:AX$114,RELAT!$B29)))","v":""},{"$f":"IF(AY$14=0,\"\",IF(AY$31<>\"qualit\",\"Não se aplica\",COUNTIF(PESQ!AY$14:AY$114,RELAT!$B29)))","v":""},{"$f":"IF(AZ$14=0,\"\",IF(AZ$31<>\"qualit\",\"Não se aplica\",COUNTIF(PESQ!AZ$14:AZ$114,RELAT!$B29)))","v":""}]
[null,10,{"$f":"IF(C$14=0,\"\",IF(C$31<>\"qualit\",\"Não se aplica\",COUNTIF(PESQ!C$14:C$114,RELAT!$B30)))","v":"Não se aplica"},{"$f":"IF(D$14=0,\"\",IF(D$31<>\"qualit\",\"Não se aplica\",COUNTIF(PESQ!D$14:D$114,RELAT!$B30)))","v":"Não se aplica"},{"$f":"IF(E$14=0,\"\",IF(E$31<>\"qualit\",\"Não se aplica\",COUNTIF(PESQ!E$14:E$114,RELAT!$B30)))","v":1},{"$f":"IF(F$14=0,\"\",IF(F$31<>\"qualit\",\"Não se aplica\",COUNTIF(PESQ!F$14:F$114,RELAT!$B30)))","v":""},{"$f":"IF(G$14=0,\"\",IF(G$31<>\"qualit\",\"Não se aplica\",COUNTIF(PESQ!G$14:G$114,RELAT!$B30)))","v":""},{"$f":"IF(H$14=0,\"\",IF(H$31<>\"qualit\",\"Não se aplica\",COUNTIF(PESQ!H$14:H$114,RELAT!$B30)))","v":""},{"$f":"IF(I$14=0,\"\",IF(I$31<>\"qualit\",\"Não se aplica\",COUNTIF(PESQ!I$14:I$114,RELAT!$B30)))","v":""},{"$f":"IF(J$14=0,\"\",IF(J$31<>\"qualit\",\"Não se aplica\",COUNTIF(PESQ!J$14:J$114,RELAT!$B30)))","v":""},{"$f":"IF(K$14=0,\"\",IF(K$31<>\"qualit\",\"Não se aplica\",COUNTIF(PESQ!K$14:K$114,RELAT!$B30)))","v":""},{"$f":"IF(L$14=0,\"\",IF(L$31<>\"qualit\",\"Não se aplica\",COUNTIF(PESQ!L$14:L$114,RELAT!$B30)))","v":""},{"$f":"IF(M$14=0,\"\",IF(M$31<>\"qualit\",\"Não se aplica\",COUNTIF(PESQ!M$14:M$114,RELAT!$B30)))","v":""},{"$f":"IF(N$14=0,\"\",IF(N$31<>\"qualit\",\"Não se aplica\",COUNTIF(PESQ!N$14:N$114,RELAT!$B30)))","v":""},{"$f":"IF(O$14=0,\"\",IF(O$31<>\"qualit\",\"Não se aplica\",COUNTIF(PESQ!O$14:O$114,RELAT!$B30)))","v":""},{"$f":"IF(P$14=0,\"\",IF(P$31<>\"qualit\",\"Não se aplica\",COUNTIF(PESQ!P$14:P$114,RELAT!$B30)))","v":""},{"$f":"IF(Q$14=0,\"\",IF(Q$31<>\"qualit\",\"Não se aplica\",COUNTIF(PESQ!Q$14:Q$114,RELAT!$B30)))","v":""},{"$f":"IF(R$14=0,\"\",IF(R$31<>\"qualit\",\"Não se aplica\",COUNTIF(PESQ!R$14:R$114,RELAT!$B30)))","v":""},{"$f":"IF(S$14=0,\"\",IF(S$31<>\"qualit\",\"Não se aplica\",COUNTIF(PESQ!S$14:S$114,RELAT!$B30)))","v":""},{"$f":"IF(T$14=0,\"\",IF(T$31<>\"qualit\",\"Não se aplica\",COUNTIF(PESQ!T$14:T$114,RELAT!$B30)))","v":""},{"$f":"IF(U$14=0,\"\",IF(U$31<>\"qualit\",\"Não se aplica\",COUNTIF(PESQ!U$14:U$114,RELAT!$B30)))","v":""},{"$f":"IF(V$14=0,\"\",IF(V$31<>\"qualit\",\"Não se aplica\",COUNTIF(PESQ!V$14:V$114,RELAT!$B30)))","v":""},{"$f":"IF(W$14=0,\"\",IF(W$31<>\"qualit\",\"Não se aplica\",COUNTIF(PESQ!W$14:W$114,RELAT!$B30)))","v":""},{"$f":"IF(X$14=0,\"\",IF(X$31<>\"qualit\",\"Não se aplica\",COUNTIF(PESQ!X$14:X$114,RELAT!$B30)))","v":""},{"$f":"IF(Y$14=0,\"\",IF(Y$31<>\"qualit\",\"Não se aplica\",COUNTIF(PESQ!Y$14:Y$114,RELAT!$B30)))","v":""},{"$f":"IF(Z$14=0,\"\",IF(Z$31<>\"qualit\",\"Não se aplica\",COUNTIF(PESQ!Z$14:Z$114,RELAT!$B30)))","v":""},{"$f":"IF(AA$14=0,\"\",IF(AA$31<>\"qualit\",\"Não se aplica\",COUNTIF(PESQ!AA$14:AA$114,RELAT!$B30)))","v":""},{"$f":"IF(AB$14=0,\"\",IF(AB$31<>\"qualit\",\"Não se aplica\",COUNTIF(PESQ!AB$14:AB$114,RELAT!$B30)))","v":""},{"$f":"IF(AC$14=0,\"\",IF(AC$31<>\"qualit\",\"Não se aplica\",COUNTIF(PESQ!AC$14:AC$114,RELAT!$B30)))","v":""},{"$f":"IF(AD$14=0,\"\",IF(AD$31<>\"qualit\",\"Não se aplica\",COUNTIF(PESQ!AD$14:AD$114,RELAT!$B30)))","v":""},{"$f":"IF(AE$14=0,\"\",IF(AE$31<>\"qualit\",\"Não se aplica\",COUNTIF(PESQ!AE$14:AE$114,RELAT!$B30)))","v":""},{"$f":"IF(AF$14=0,\"\",IF(AF$31<>\"qualit\",\"Não se aplica\",COUNTIF(PESQ!AF$14:AF$114,RELAT!$B30)))","v":""},{"$f":"IF(AG$14=0,\"\",IF(AG$31<>\"qualit\",\"Não se aplica\",COUNTIF(PESQ!AG$14:AG$114,RELAT!$B30)))","v":""},{"$f":"IF(AH$14=0,\"\",IF(AH$31<>\"qualit\",\"Não se aplica\",COUNTIF(PESQ!AH$14:AH$114,RELAT!$B30)))","v":""},{"$f":"IF(AI$14=0,\"\",IF(AI$31<>\"qualit\",\"Não se aplica\",COUNTIF(PESQ!AI$14:AI$114,RELAT!$B30)))","v":""},{"$f":"IF(AJ$14=0,\"\",IF(AJ$31<>\"qualit\",\"Não se aplica\",COUNTIF(PESQ!AJ$14:AJ$114,RELAT!$B30)))","v":""},{"$f":"IF(AK$14=0,\"\",IF(AK$31<>\"qualit\",\"Não se aplica\",COUNTIF(PESQ!AK$14:AK$114,RELAT!$B30)))","v":""},{"$f":"IF(AL$14=0,\"\",IF(AL$31<>\"qualit\",\"Não se aplica\",COUNTIF(PESQ!AL$14:AL$114,RELAT!$B30)))","v":""},{"$f":"IF(AM$14=0,\"\",IF(AM$31<>\"qualit\",\"Não se aplica\",COUNTIF(PESQ!AM$14:AM$114,RELAT!$B30)))","v":""},{"$f":"IF(AN$14=0,\"\",IF(AN$31<>\"qualit\",\"Não se aplica\",COUNTIF(PESQ!AN$14:AN$114,RELAT!$B30)))","v":""},{"$f":"IF(AO$14=0,\"\",IF(AO$31<>\"qualit\",\"Não se aplica\",COUNTIF(PESQ!AO$14:AO$114,RELAT!$B30)))","v":""},{"$f":"IF(AP$14=0,\"\",IF(AP$31<>\"qualit\",\"Não se aplica\",COUNTIF(PESQ!AP$14:AP$114,RELAT!$B30)))","v":""},{"$f":"IF(AQ$14=0,\"\",IF(AQ$31<>\"qualit\",\"Não se aplica\",COUNTIF(PESQ!AQ$14:AQ$114,RELAT!$B30)))","v":""},{"$f":"IF(AR$14=0,\"\",IF(AR$31<>\"qualit\",\"Não se aplica\",COUNTIF(PESQ!AR$14:AR$114,RELAT!$B30)))","v":""},{"$f":"IF(AS$14=0,\"\",IF(AS$31<>\"qualit\",\"Não se aplica\",COUNTIF(PESQ!AS$14:AS$114,RELAT!$B30)))","v":""},{"$f":"IF(AT$14=0,\"\",IF(AT$31<>\"qualit\",\"Não se aplica\",COUNTIF(PESQ!AT$14:AT$114,RELAT!$B30)))","v":""},{"$f":"IF(AU$14=0,\"\",IF(AU$31<>\"qualit\",\"Não se aplica\",COUNTIF(PESQ!AU$14:AU$114,RELAT!$B30)))","v":""},{"$f":"IF(AV$14=0,\"\",IF(AV$31<>\"qualit\",\"Não se aplica\",COUNTIF(PESQ!AV$14:AV$114,RELAT!$B30)))","v":""},{"$f":"IF(AW$14=0,\"\",IF(AW$31<>\"qualit\",\"Não se aplica\",COUNTIF(PESQ!AW$14:AW$114,RELAT!$B30)))","v":""},{"$f":"IF(AX$14=0,\"\",IF(AX$31<>\"qualit\",\"Não se aplica\",COUNTIF(PESQ!AX$14:AX$114,RELAT!$B30)))","v":""},{"$f":"IF(AY$14=0,\"\",IF(AY$31<>\"qualit\",\"Não se aplica\",COUNTIF(PESQ!AY$14:AY$114,RELAT!$B30)))","v":""},{"$f":"IF(AZ$14=0,\"\",IF(AZ$31<>\"qualit\",\"Não se aplica\",COUNTIF(PESQ!AZ$14:AZ$114,RELAT!$B30)))","v":""}]
[null,null,{"$f":"PESQ!C115","v":"bin"},{"$f":"PESQ!D115","v":"avaliacao"},{"$f":"PESQ!E115","v":"qualit"}]

{"sheet":"Dash","index":5,"n_rows":0,"n_cols":0,"rows_kept":0,"cut":false,"hidden":false,"merged":[]}

{"sheet":"Dash (2)","index":6,"n_rows":13,"n_cols":4,"rows_kept":13,"cut":false,"hidden":false,"merged":[[12,3,13,20]]}
[]
[]
[]
[]
[]
[]
[]
[]
[]
[]
[]
[]
[null,null,null,"Qual sua avaliação em relação ao prazo de entrega dos produtos?"]

{"sheet":"Instruções","index":7,"n_rows":0,"n_cols":0,"rows_kept":0,"cut":false,"hidden":false,"merged":[]}

{"sheet":"calc","index":8,"n_rows":18,"n_cols":18,"rows_kept":18,"cut":false,"hidden":false,"merged":[]}
[{"$f":"RESP!B15","v":"Sim"},{"$f":"COUNTIF(PESQ!$C$14:$AZ$114,calc!A1)","v":3},null,"Selecionado:",{"$f":"'Dash (2)'!D13","v":"Qual sua avaliação em relação ao prazo de entrega dos produtos?"},null,null,null,null,null,null,null,"Top 5 Maiores Notas",null,null,null,"Top 5 Menores Notas"]
[{"$f":"RESP!B16","v":"Não"},{"$f":"COUNTIF(PESQ!$C$14:$AZ$114,calc!A2)","v":2},null,"Tipo de Resposta:",{"$f":"IFERROR(VLOOKUP(E1,RESP!$F$15:$G$64,2,0),\"\")","v":"Avaliação"},null,null,null,null,null,null,5,{"$f":"IFERROR(LARGE(PESQ!$C$138:$AZ$138,calc!L2),NA())","v":{"$error":"#N/A"}},{"$f":"HLOOKUP(M2,PESQ!$C$138:$AZ$139,2,0)","v":{"$error":"#N/A"}},null,5,{"$f":"IFERROR(SMALL(PESQ!$C$138:$AZ$138,calc!P2),NA())","v":{"$error":"#N/A"}},{"$f":"HLOOKUP(Q2,PESQ!$C$138:$AZ$139,2,0)","v":{"$error":"#N/A"}}]
[null,null,null,null,null,null,null,null,null,null,null,4,{"$f":"IFERROR(LARGE(PESQ!$C$138:$AZ$138,calc!L3),NA())","v":{"$error":"#N/A"}},{"$f":"HLOOKUP(M3,PESQ!$C$138:$AZ$139,2,0)","v":{"$error":"#N/A"}},null,4,{"$f":"IFERROR(SMALL(PESQ!$C$138:$AZ$138,calc!P3),NA())","v":{"$error":"#N/A"}},{"$f":"HLOOKUP(Q3,PESQ!$C$138:$AZ$139,2,0)","v":{"$error":"#N/A"}}]
[{"$f":"RESP!C15","v":"Excelente"},{"$f":"COUNTIF(PESQ!$C$14:$AZ$114,calc!A4)","v":2},null,{"$f":"IF($E$2=\"Binária\",A1,IF($E$2=\"Avaliação\",A4,IF($E$2=\"Qualitativa\",A9,\"\")))","v":"Excelente"},{"$f":"IFERROR(HLOOKUP($E$1,PESQ!C$12:AB$133,F4,0),\"\")","v":2},{"$f":"IF($E$2=\"Binária\",105,IF($E$2=\"Avaliação\",108,IF($E$2=\"Qualitativa\",113,\"\")))","v":108},null,{"$f":"D4","v":"Excelente"},{"$f":"IFERROR(E4/$J$4,\"\")","v":0.4},{"$f":"SUM(E4:E13)","v":5},null,3,{"$f":"IFERROR(LARGE(PESQ!$C$138:$AZ$138,calc!L4),NA())","v":0.46},{"$f":"HLOOKUP(M4,PESQ!$C$138:$AZ$139,2,0)","v":"Qual sua nota referente ao nosso atendimento telefônico?"},null,3,{"$f":"IFERROR(SMALL(PESQ!$C$138:$AZ$138,calc!P4),NA())","v":0.64},{"$f":"HLOOKUP(Q4,PESQ!$C$138:$AZ$139,2,0)","v":"Qual sua avaliação em relação ao prazo de entrega dos produtos?"}]
[{"$f":"RESP!C16","v":"Bom"},{"$f":"COUNTIF(PESQ!$C$14:$AZ$114,calc!A5)","v":1},null,{"$f":"IF($E$2=\"Binária\",A2,IF($E$2=\"Avaliação\",A5,IF($E$2=\"Qualitativa\",A10,\"\")))","v":"Bom"},{"$f":"IFERROR(HLOOKUP($E$1,PESQ!C$12:AB$133,F5,0),\"\")","v":1},{"$f":"IF(D5=\"\",\"\",F4+1)","v":109},null,{"$f":"D5","v":"Bom"},{"$f":"IFERROR(E5/$J$4,\"\")","v":0.2},null,null,2,{"$f":"IFERROR(LARGE(PESQ!$C$138:$AZ$138,calc!L5),NA())","v":0.6},{"$f":"HLOOKUP(M5,PESQ!$C$138:$AZ$139,2,0)","v":"Você indicaria nossos produtos?"},null,2,{"$f":"IFERROR(SMALL(PESQ!$C$138:$AZ$138,calc!P5),NA())","v":0.6},{"$f":"HLOOKUP(Q5,PESQ!$C$138:$AZ$139,2,0)","v":"Você indicaria nossos produtos?"}]
[{"$f":"RESP!C17","v":"Ruim"},{"$f":"COUNTIF(PESQ!$C$14:$AZ$114,calc!A6)","v":1},null,{"$f":"IF($E$2=\"Avaliação\",A6,IF($E$2=\"Qualitativa\",A11,\"\"))","v":"Ruim"},{"$f":"IFERROR(HLOOKUP($E$1,PESQ!C$12:AB$133,F6,0),\"\")","v":1},{"$f":"IF(D6=\"\",\"\",F5+1)","v":110},null,"Ruim",0.2,null,null,1,{"$f":"IFERROR(LARGE(PESQ!$C$138:$AZ$138,calc!L6),NA())","v":0.64},{"$f":"HLOOKUP(M6,PESQ!$C$138:$AZ$139,2,0)","v":"Qual sua avaliação em relação ao prazo de entrega dos produtos?"},null,1,{"$f":"IFERROR(SMALL(PESQ!$C$138:$AZ$138,calc!P6),NA())","v":0.46},{"$f":"HLOOKUP(Q6,PESQ!$C$138:$AZ$139,2,0)","v":"Qual sua nota referente ao nosso atendimento telefônico?"}]
[{"$f":"RESP!C18","v":"Péssimo"},{"$f":"COUNTIF(PESQ!$C$14:$AZ$114,calc!A7)","v":1},null,{"$f":"IF($E$2=\"Avaliação\",A7,IF($E$2=\"Qualitativa\",A12,\"\"))","v":"Péssimo"},{"$f":"IFERROR(HLOOKUP($E$1,PESQ!C$12:AB$133,F7,0),\"\")","v":1},111,null,"Péssimo",0.2]
[null,null,null,{"$f":"IF($E$2=\"Qualitativa\",A13,\"\")","v":""},{"$f":"IFERROR(HLOOKUP($E$1,PESQ!C$12:AB$133,F8,0),\"\")","v":""},"",null,"",""]
[{"$f":"RESP!D15","v":1},{"$f":"COUNTIF(PESQ!$C$14:$AZ$114,calc!A9)","v":0},null,{"$f":"IF($E$2=\"Qualitativa\",A14,\"\")","v":""},{"$f":"IFERROR(HLOOKUP($E$1,PESQ!C$12:AB$133,F9,0),\"\")","v":""},"",null,"",""]
[{"$f":"RESP!D16","v":2},{"$f":"COUNTIF(PESQ!$C$14:$AZ$114,calc!A10)","v":2},null,"",{"$f":"IFERROR(HLOOKUP($E$1,PESQ!C$12:AB$133,F10,0),\"\")","v":""},"",null,"",""]
[{"$f":"RESP!D17","v":3},{"$f":"COUNTIF(PESQ!$C$14:$AZ$114,calc!A11)","v":0},null,"",{"$f":"IFERROR(HLOOKUP($E$1,PESQ!C$12:AB$133,F11,0),\"\")","v":""},"",null,"",""]
[{"$f":"RESP!D18","v":4},{"$f":"COUNTIF(PESQ!$C$14:$AZ$114,calc!A12)","v":1},null,"",{"$f":"IFERROR(HLOOKUP($E$1,PESQ!C$12:AB$133,F12,0),\"\")","v":""},"",null,"",""]
[{"$f":"RESP!D19","v":5},{"$f":"COUNTIF(PESQ!$C$14:$AZ$114,calc!A13)","v":1},null,"",{"$f":"IFERROR(HLOOKUP($E$1,PESQ!C$12:AB$133,F13,0),\"\")","v":""},"",null,"",""]
[{"$f":"RESP!D20","v":6},{"$f":"COUNTIF(PESQ!$C$14:$AZ$114,calc!A14)","v":0}]
[{"$f":"RESP!D21","v":7},{"$f":"COUNTIF(PESQ!$C$14:$AZ$114,calc!A15)","v":0}]
[{"$f":"RESP!D22","v":8},{"$f":"COUNTIF(PESQ!$C$14:$AZ$114,calc!A16)","v":0}]
[{"$f":"RESP!D23","v":9},{"$f":"COUNTIF(PESQ!$C$14:$AZ$114,calc!A17)","v":0}]
[{"$f":"RESP!D24","v":10},{"$f":"COUNTIF(PESQ!$C$14:$AZ$114,calc!A18)","v":1}]