{"text_format":"1","workbook":"xlsx","n_sheets":9,"sheets":["Menu","PERFIL","RESP","PESQ","RELAT","Dash","Dash (2)","Instruções","calc"],"not_rendered":{"charts":7,"images":10,"macros":1,"external_links":0,"defined_names":14,"comments":0,"pivot_tables":0},"unopened":[],"bounds":{"document_bytes":16777216,"sheet_cells":100000,"rows_first":2000,"rows_last":500,"rows_between":2000,"halvings":0,"cell_chars":16384,"cell_head_chars":4096},"cells_cut":0,"cells_raw":0,"read":"whole","date_system":"1900"}

{"sheet":"Menu","index":0,"n_rows":0,"n_cols":0,"rows_kept":0,"cut":false,"hidden":false,"merged":[]}

{"sheet":"PERFIL","index":1,"n_rows":115,"n_cols":8,"rows_kept":115,"cut":false,"hidden":false,"merged":[[12,1,13,1],[11,3,11,7],[12,3,13,3],[12,4,13,4],[12,5,13,5],[12,6,13,6],[12,7,13,7]]}
[]
[]
[]
[]
[]
[]
[]
[]
[]
[]
[]
[null,"Cadastro de Perfil\nInsira os perfis que melhor representa seus clientes.",null,"Cadastro de Clientes\nInsira as informações dos seus clientes"]
[null,"Perfil",null,"Cliente","Perfil do Cliente","Telefone","E-mail","Idade"]
[]
[null,"Perfil 1",null,"Cliente 1","Perfil 1","9999-9999","entrevistado1@123.com.br",35]
{"$rows_left_out":101}
{"sheet":"RESP","index":2,"n_rows":65,"n_cols":7,"rows_kept":65,"cut":false,"hidden":false,"merged":[[12,1,13,1],[12,2,13,2],[12,3,13,3],[11,1,11,3],[11,5,11,6],[12,5,13,5],[12,6,13,6]]}
[]
[]
[]
[]
[]
[]
[]
[]
[]
[]
[]
[null,"Tipo de Resposta\nInsira as configurações do tipo de resposta.",null,null,null,"Cadastro de Perguntas\nInsira as perguntas relevantes para seus clientes"]
[null,"Binária","Avaliação","Qualitativa",null,"Pergunta","Tipo de Resposta"]
[]
[null,"Sim","Excelente",1,null,"Você indicaria nossos produtos?","Binária"]
{"$rows_left_out":51}
{"sheet":"PESQ","index":3,"n_rows":139,"n_cols":52,"rows_kept":139,"cut":false,"hidden":false,"merged":[[11,50,12,50],[11,51,12,51],[11,45,12,45],[11,46,12,46],[11,47,12,47],[11,48,12,48],[11,49,12,49],[11,40,12,40],[11,41,12,41],[11,42,12,42],[11,43,12,43],[11,44,12,44],[11,35,12,35],[11,36,12,36],[11,37,12,37],[11,38,12,38],[11,39,12,39],[11,30,12,30],[11,31,12,31],[11,32,12,32],[11,33,12,33],[11,34,12,34],[11,25,12,25],[11,26,12,26],[11,27,12,27],[11,28,12,28],[11,29,12,29],[11,20,12,20],[11,21,12,21],[11,22,12,22],[11,23,12,23],[11,24,12,24],[11,15,12,15],[11,16,12,16],[11,17,12,17],[11,18,12,18],[11,19,12,19],[11,10,12,10],[11,11,12,11],[11,12,12,12],[11,13,12,13],[11,14,12,14],[11,5,12,5],[11,6,12,6],[11,7,12,7],[11,8,12,8],[11,9,12,9],[10,1,10,2],[11,1,12,1],[11,2,12,2],[11,3,12,3],[11,4,12,4]]}
[]
[]
[]
[]
[]
[]
[]
[]
[]
[]
[null,"Pesquisa de Satisfação de Clientes\nInsira as respostas para cada cliente."]
[null,"Cliente",{"$f":"RESP!$F$15","v":"Você indicaria nossos produtos?"},{"$f":"RESP!$F$16","v":"Qual sua avaliação em relação ao prazo de entrega dos produtos?"},{"$f":"RESP!$F$17","v":"Qual sua nota referente ao nosso atendimento telefônico?"},{"$f":"RESP!$F$18","v":"O Produto atendeu as suas expectativas?"},{"$f":"RESP!$F$19","v":0},{"$f":"RESP!$F$20","v":0},{"$f":"RESP!$F$21","v":0},{"$f":"RESP!$F$22","v":0},{"$f":"RESP!$F$23","v":0},{"$f":"RESP!$F$24","v":0},{"$f":"RESP!$F$25","v":0},{"$f":"RESP!$F$26","v":0},{"$f":"RESP!$F$27","v":0},{"$f":"RESP!$F$28","v":0},{"$f":"RESP!$F$29","v":0},{"$f":"RESP!$F$30","v":0},{"$f":"RESP!$F$31","v":0},{"$f":"RESP!$F$32","v":0},{"$f":"RESP!$F$33","v":0},{"$f":"RESP!$F$34","v":0},{"$f":"RESP!$F$35","v":0},{"$f":"RESP!$F$36","v":0},{"$f":"RESP!$F$37","v":0},{"$f":"RESP!$F$38","v":0},{"$f":"RESP!$F$39","v":0},{"$f":"RESP!$F$40","v":0},{"$f":"RESP!$F$41","v":0},{"$f":"RESP!$F$42","v":0},{"$f":"RESP!$F$43","v":0},{"$f":"RESP!$F$44","v":0},{"$f":"RESP!$F$45","v":0},{"$f":"RESP!$F$46","v":0},{"$f":"RESP!$F$47","v":0},{"$f":"RESP!$F$48","v":0},{"$f":"RESP!$F$49","v":0},{"$f":"RESP!$F$50","v":0},{"$f":"RESP!$F$51","v":0},{"$f":"RESP!$F$52","v":0},{"$f":"RESP!$F$53","v":0},{"$f":"RESP!$F$54","v":0},{"$f":"RESP!$F$55","v":0},{"$f":"RESP!$F$56","v":0},{"$f":"RESP!$F$57","v":0},{"$f":"RESP!$F$58","v":0},{"$f":"RESP!$F$59","v":0},{"$f":"RESP!$F$60","v":0},{"$f":"RESP!$F$61","v":0},{"$f":"RESP!$F$62","v":0},{"$f":"RESP!$F$63","v":0},{"$f":"RESP!$F$64","v":0}]
[]
[null,{"$f":"IF(PERFIL!D15=\"\",\"\",PERFIL!D15)","v":"Cliente 1"},"Sim","Excelente",2]
[null,{"$f":"IF(PERFIL!D16=\"\",\"\",PERFIL!D16)","v":"Cliente 2"},"Não","Bom",4]
{"$rows_left_out":125}
{"sheet":"RELAT","index":4,"n_rows":31,"n_cols":52,"rows_kept":31,"cut":false,"hidden":false,"merged":[[11,1,12,1],[11,46,12,46],[11,47,12,47],[11,48,12,48],[11,49,12,49],[11,34,12,34],[11,35,12,35],[11,36,12,36],[11,37,12,37],[11,38,12,38],[11,39,12,39],[11,28,12,28],[11,29,12,29],[11,30,12,30],[11,31,12,31],[11,32,12,32],[11,50,12,50],[11,51,12,51],[11,40,12,40],[11,41,12,41],[11,42,12,42],[11,43,12,43],[11,44,12,44],[11,45,12,45],[11,33,12,33],[11,22,12,22],[11,23,12,23],[11,24,12,24],[11,25,12,25],[11,26,12,26],[11,27,12,27],[11,21,12,21],[11,10,12,10],[11,11,12,11],[11,12,12,12],[11,13,12,13],[11,14,12,14],[11,15,12,15],[11,16,12,16],[11,17,12,17],[11,18,12,18],[11,19,12,19],[11,20,12,20],[11,7,12,7],[11,8,12,8],[11,9,12,9],[11,2,12,2],[11,3,12,3],[11,4,12,4],[11,5,12,5],[11,6,12,6]]}
[]
[]
[]
[]
[]
[]
[]
[]
[]
[]
[]
[null,"Perguntas",{"$f":"RESP!$F$15","v":"Você indicaria nossos produtos?"},{"$f":"RESP!$F$16","v":"Qual sua avaliação em relação ao prazo de entrega dos produtos?"},{"$f":"RESP!$F$17","v":"Qual sua nota referente ao nosso atendimento telefônico?"},{"$f":"RESP!$F$18","v":"O Produto atendeu as suas expectativas?"},{"$f":"RESP!$F$19","v":0},{"$f":"RESP!$F$20","v":0},{"$f":"RESP!$F$21","v":0},{"$f":"RESP!$F$22","v":0},{"$f":"RESP!$F$23","v":0},{"$f":"RESP!$F$24","v":0},{"$f":"RESP!$F$25","v":0},{"$f":"RESP!$F$26","v":0},{"$f":"RESP!$F$27","v":0},{"$f":"RESP!$F$28","v":0},{"$f":"RESP!$F$29","v":0},{"$f":"RESP!$F$30","v":0},{"$f":"RESP!$F$31","v":0},{"$f":"RESP!$F$32","v":0},{"$f":"RESP!$F$33","v":0},{"$f":"RESP!$F$34","v":0},{"$f":"RESP!$F$35","v":0},{"$f":"RESP!$F$36","v":0},{"$f":"RESP!$F$37","v":0},{"$f":"RESP!$F$38","v":0},{"$f":"RESP!$F$39","v":0},{"$f":"RESP!$F$40","v":0},{"$f":"RESP!$F$41","v":0},{"$f":"RESP!$F$42","v":0},{"$f":"RESP!$F$43","v":0},{"$f":"RESP!$F$44","v":0},{"$f":"RESP!$F$45","v":0},{"$f":"RESP!$F$46","v":0},{"$f":"RESP!$F$47","v":0},{"$f":"RESP!$F$48","v":0},{"$f":"RESP!$F$49","v":0},{"$f":"RESP!$F$50","v":0},{"$f":"RESP!$F$51","v":0},{"$f":"RESP!$F$52","v":0},{"$f":"RESP!$F$53","v":0},{"$f":"RESP!$F$54","v":0},{"$f":"RESP!$F$55","v":0},{"$f":"RESP!$F$56","v":0},{"$f":"RESP!$F$57","v":0},{"$f":"RESP!$F$58","v":0},{"$f":"RESP!$F$59","v":0},{"$f":"RESP!$F$60","v":0},{"$f":"RESP!$F$61","v":0},{"$f":"RESP!$F$62","v":0},{"$f":"RESP!$F$63","v":0},{"$f":"RESP!$F$64","v":0}]
[]
[null,"Total de Respostas",{"$f":"COUNTA(PESQ!C14:C114)","v":5},{"$f":"COUNTA(PESQ!D14:D114)","v":5},{"$f":"COUNTA(PESQ!E14:E114)","v":5},{"$f":"COUNTA(PESQ!F14:F114)","v":0},{"$f":"COUNTA(PESQ!G14:G114)","v":0},{"$f":"COUNTA(PESQ!H14:H114)","v":0},{"$f":"COUNTA(PESQ!I14:I114)","v":0},{"$f":"COUNTA(PESQ!J14:J114)","v":0},{"$f":"COUNTA(PESQ!K14:K114)","v":0},{"$f":"COUNTA(PESQ!L14:L114)","v":0},{"$f":"COUNTA(PESQ!M14:M114)","v":0},{"$f":"COUNTA(PESQ!N14:N114)","v":0},{"$f":"COUNTA(PESQ!O14:O114)","v":0},{"$f":"COUNTA(PESQ!P14:P114)","v":0},{"$f":"COUNTA(PESQ!Q14:Q114)","v":0},{"$f":"COUNTA(PESQ!R14:R114)","v":0},{"$f":"COUNTA(PESQ!S14:S114)","v":0},{"$f":"COUNTA(PESQ!T14:T114)","v":0},{"$f":"COUNTA(PESQ!U14:U114)","v":0},{"$f":"COUNTA(PESQ!V14:V114)","v":0},{"$f":"COUNTA(PESQ!W14:W114)","v":0},{"$f":"COUNTA(PESQ!X14:X114)","v":0},{"$f":"COUNTA(PESQ!Y14:Y114)","v":0},{"$f":"COUNTA(PESQ!Z14:Z114)","v":0},{"$f":"COUNTA(PESQ!AA14:AA114)","v":0},{"$f":"COUNTA(PESQ!AB14:AB114)","v":0},{"$f":"COUNTA(PESQ!AC14:AC114)","v":0},{"$f":"COUNTA(PESQ!AD14:AD114)","v":0},{"$f":"COUNTA(PESQ!AE14:AE114)","v":0},{"$f":"COUNTA(PESQ!AF14:AF114)","v":0},{"$f":"COUNTA(PESQ!AG14:AG114)","v":0},{"$f":"COUNTA(PESQ!AH14:AH114)","v":0},{"$f":"COUNTA(PESQ!AI14:AI114)","v":0},{"$f":"COUNTA(PESQ!AJ14:AJ114)","v":0},{"$f":"COUNTA(PESQ!AK14:AK114)","v":0},{"$f":"COUNTA(PESQ!AL14:AL114)","v":0},{"$f":"COUNTA(PESQ!AM14:AM114)","v":0},{"$f":"COUNTA(PESQ!AN14:AN114)","v":0},{"$f":"COUNTA(PESQ!AO14:AO114)","v":0},{"$f":"COUNTA(PESQ!AP14:AP114)","v":0},{"$f":"COUNTA(PESQ!AQ14:AQ114)","v":0},{"$f":"COUNTA(PESQ!AR14:AR114)","v":0},{"$f":"COUNTA(PESQ!AS14:AS114)","v":0},{"$f":"COUNTA(PESQ!AT14:AT114)","v":0},{"$f":"COUNTA(PESQ!AU14:AU114)","v":0},{"$f":"COUNTA(PESQ!AV14:AV114)","v":0},{"$f":"COUNTA(PESQ!AW14:AW114)","v":0},{"$f":"COUNTA(PESQ!AX14:AX114)","v":0},{"$f":"COUNTA(PESQ!AY14:AY114)","v":0},{"$f":"COUNTA(PESQ!AZ14:AZ114)","v":0}]
[null,"Sim",{"$f":"IF(C$14=0,\"\",IF(C$31<>\"bin\",\"Não se aplica\",COUNTIF(PESQ!C$14:C$114,RELAT!$B15)))","v":3},{"$f":"IF(D$14=0,\"\",IF(D$31<>\"bin\",\"Não se aplica\",COUNTIF(PESQ!D$14:D$114,RELAT!$B15)))","v":"Não se aplica"},{"$f":"IF(E$14=0,\"\",IF(E$31<>\"bin\",\"Não se aplica\",COUNTIF(PESQ!E$14:E$114,RELAT!$B15)))","v":"Não se aplica"},{"$f":"IF(F$14=0,\"\",IF(F$31<>\"bin\",\"Não se aplica\",COUNTIF(PESQ!F$14:F$114,RELAT!$B15)))","v":""},{"$f":"IF(G$14=0,\"\",IF(G$31<>\"bin\",\"Não se aplica\",COUNTIF(PESQ!G$14:G$114,RELAT!$B15)))","v":""},{"$f":"IF(H$14=0,\"\",IF(H$31<>\"bin\",\"Não se aplica\",COUNTIF(PESQ!H$14:H$114,RELAT!$B15)))","v":""},{"$f":"IF(I$14=0,\"\",IF(I$31<>\"bin\",\"Não se aplica\",COUNTIF(PESQ!I$14:I$114,RELAT!$B15)))","v":""},{"$f":"IF(J$14=0,\"\",IF(J$31<>\"bin\",\"Não se aplica\",COUNTIF(PESQ!J$14:J$114,RELAT!$B15)))","v":""},{"$f":"IF(K$14=0,\"\",IF(K$31<>\"bin\",\"Não se aplica\",COUNTIF(PESQ!K$14:K$114,RELAT!$B15)))","v":""},{"$f":"IF(L$14=0,\"\",IF(L$31<>\"bin\",\"Não se aplica\",COUNTIF(PESQ!L$14:L$114,RELAT!$B15)))","v":""},{"$f":"IF(M$14=0,\"\",IF(M$31<>\"bin\",\"Não se aplica\",COUNTIF(PESQ!M$14:M$114,RELAT!$B15)))","v":""},{"$f":"IF(N$14=0,\"\",IF(N$31<>\"bin\",\"Não se aplica\",COUNTIF(PESQ!N$14:N$114,RELAT!$B15)))","v":""},{"$f":"IF(O$14=0,\"\",IF(O$31<>\"bin\",\"Não se aplica\",COUNTIF(PESQ!O$14:O$114,RELAT!$B15)))","v":""},{"$f":"IF(P$14=0,\"\",IF(P$31<>\"bin\",\"Não se aplica\",COUNTIF(PESQ!P$14:P$114,RELAT!$B15)))","v":""},{"$f":"IF(Q$14=0,\"\",IF(Q$31<>\"bin\",\"Não se aplica\",COUNTIF(PESQ!Q$14:Q$114,RELAT!$B15)))","v":""},{"$f":"IF(R$14=0,\"\",IF(R$31<>\"bin\",\"Não se aplica\",COUNTIF(PESQ!R$14:R$114,RELAT!$B15)))","v":""},{"$f":"IF(S$14=0,\"\",IF(S$31<>\"bin\",\"Não se aplica\",COUNTIF(PESQ!S$14:S$114,RELAT!$B15)))","v":""},{"$f":"IF(T$14=0,\"\",IF(T$31<>\"bin\",\"Não se aplica\",COUNTIF(PESQ!T$14:T$114,RELAT!$B15)))","v":""},{"$f":"IF(U$14=0,\"\",IF(U$31<>\"bin\",\"Não se aplica\",COUNTIF(PESQ!U$14:U$114,RELAT!$B15)))","v":""},{"$f":"IF(V$14=0,\"\",IF(V$31<>\"bin\",\"Não se aplica\",COUNTIF(PESQ!V$14:V$114,RELAT!$B15)))","v":""},{"$f":"IF(W$14=0,\"\",IF(W$31<>\"bin\",\"Não se aplica\",COUNTIF(PESQ!W$14:W$114,RELAT!$B15)))","v":""},{"$f":"IF(X$14=0,\"\",IF(X$31<>\"bin\",\"Não se aplica\",COUNTIF(PESQ!X$14:X$114,RELAT!$B15)))","v":""},{"$f":"IF(Y$14=0,\"\",IF(Y$31<>\"bin\",\"Não se aplica\",COUNTIF(PESQ!Y$14:Y$114,RELAT!$B15)))","v":""},{"$f":"IF(Z$14=0,\"\",IF(Z$31<>\"bin\",\"Não se aplica\",COUNTIF(PESQ!Z$14:Z$114,RELAT!$B15)))","v":""},{"$f":"IF(AA$14=0,\"\",IF(AA$31<>\"bin\",\"Não se aplica\",COUNTIF(PESQ!AA$14:AA$114,RELAT!$B15)))","v":""},{"$f":"IF(AB$14=0,\"\",IF(AB$31<>\"bin\",\"Não se aplica\",COUNTIF(PESQ!AB$14:AB$114,RELAT!$B15)))","v":""},{"$f":"IF(AC$14=0,\"\",IF(AC$31<>\"bin\",\"Não se aplica\",COUNTIF(PESQ!AC$14:AC$114,RELAT!$B15)))","v":""},{"$f":"IF(AD$14=0,\"\",IF(AD$31<>\"bin\",\"Não se aplica\",COUNTIF(PESQ!AD$14:AD$114,RELAT!$B15)))","v":""},{"$f":"IF(AE$14=0,\"\",IF(AE$31<>\"bin\",\"Não se aplica\",COUNTIF(PESQ!AE$14:AE$114,RELAT!$B15)))","v":""},{"$f":"IF(AF$14=0,\"\",IF(AF$31<>\"bin\",\"Não se aplica\",COUNTIF(PESQ!AF$14:AF$114,RELAT!$B15)))","v":""},{"$f":"IF(AG$14=0,\"\",IF(AG$31<>\"bin\",\"Não se aplica\",COUNTIF(PESQ!AG$14:AG$114,RELAT!$B15)))","v":""},{"$f":"IF(AH$14=0,\"\",IF(AH$31<>\"bin\",\"Não se aplica\",COUNTIF(PESQ!AH$14:AH$114,RELAT!$B15)))","v":""},{"$f":"IF(AI$14=0,\"\",IF(AI$31<>\"bin\",\"Não se aplica\",COUNTIF(PESQ!AI$14:AI$114,RELAT!$B15)))","v":""},{"$f":"IF(AJ$14=0,\"\",IF(AJ$31<>\"bin\",\"Não se aplica\",COUNTIF(PESQ!AJ$14:AJ$114,RELAT!$B15)))","v":""},{"$f":"IF(AK$14=0,\"\",IF(AK$31<>\"bin\",\"Não se aplica\",COUNTIF(PESQ!AK$14:AK$114,RELAT!$B15)))","v":""},{"$f":"IF(AL$14=0,\"\",IF(AL$31<>\"bin\",\"Não se aplica\",COUNTIF(PESQ!AL$14:AL$114,RELAT!$B15)))","v":""},{"$f":"IF(AM$14=0,\"\",IF(AM$31<>\"bin\",\"Não se aplica\",COUNTIF(PESQ!AM$14:AM$114,RELAT!$B15)))","v":""},{"$f":"IF(AN$14=0,\"\",IF(AN$31<>\"bin\",\"Não se aplica\",COUNTIF(PESQ!AN$14:AN$114,RELAT!$B15)))","v":""},{"$f":"IF(AO$14=0,\"\",IF(AO$31<>\"bin\",\"Não se aplica\",COUNTIF(PESQ!AO$14:AO$114,RELAT!$B15)))","v":""},{"$f":"IF(AP$14=0,\"\",IF(AP$31<>\"bin\",\"Não se aplica\",COUNTIF(PESQ!AP$14:AP$114,RELAT!$B15)))","v":""},{"$f":"IF(AQ$14=0,\"\",IF(AQ$31<>\"bin\",\"Não se aplica\",COUNTIF(PESQ!AQ$14:AQ$114,RELAT!$B15)))","v":""},{"$f":"IF(AR$14=0,\"\",IF(AR$31<>\"bin\",\"Não se aplica\",COUNTIF(PESQ!AR$14:AR$114,RELAT!$B15)))","v":""},{"$f":"IF(AS$14=0,\"\",IF(AS$31<>\"bin\",\"Não se aplica\",COUNTIF(PESQ!AS$14:AS$114,RELAT!$B15)))","v":""},{"$f":"IF(AT$14=0,\"\",IF(AT$31<>\"bin\",\"Não se aplica\",COUNTIF(PESQ!AT$14:AT$114,RELAT!$B15)))","v":""},{"$f":"IF(AU$14=0,\"\",IF(AU$31<>\"bin\",\"Não se aplica\",COUNTIF(PESQ!AU$14:AU$114,RELAT!$B15)))","v":""},{"$f":"IF(AV$14=0,\"\",IF(AV$31<>\"bin\",\"Não se aplica\",COUNTIF(PESQ!AV$14:AV$114,RELAT!$B15)))","v":""},{"$f":"IF(AW$14=0,\"\",IF(AW$31<>\"bin\",\"Não se aplica\",COUNTIF(PESQ!AW$14:AW$114,RELAT!$B15)))","v":""},{"$f":"IF(AX$14=0,\"\",IF(AX$31<>\"bin\",\"Não se aplica\",COUNTIF(PESQ!AX$14:AX$114,RELAT!$B15)))","v":""},{"$f":"IF(AY$14=0,\"\",IF(AY$31<>\"bin\",\"Não se aplica\",COUNTIF(PESQ!AY$14:AY$114,RELAT!$B15)))","v":""},{"$f":"IF(AZ$14=0,\"\",IF(AZ$31<>\"bin\",\"Não se aplica\",COUNTIF(PESQ!AZ$14:AZ$114,RELAT!$B15)))","v":""}]
{"$rows_left_out":17}
{"sheet":"Dash","index":5,"n_rows":0,"n_cols":0,"rows_kept":0,"cut":false,"hidden":false,"merged":[]}

{"sheet":"Dash (2)","index":6,"n_rows":13,"n_cols":4,"rows_kept":13,"cut":false,"hidden":false,"merged":[[12,3,13,20]]}
[]
[]
[]
[]
[]
[]
[]
[]
[]
[]
[]
[]
[null,null,null,"Qual sua avaliação em relação ao prazo de entrega dos produtos?"]

{"sheet":"Instruções","index":7,"n_rows":0,"n_cols":0,"rows_kept":0,"cut":false,"hidden":false,"merged":[]}

{"sheet":"calc","index":8,"n_rows":18,"n_cols":18,"rows_kept":18,"cut":false,"hidden":false,"merged":[]}
[{"$f":"RESP!B15","v":"Sim"},{"$f":"COUNTIF(PESQ!$C$14:$AZ$114,calc!A1)","v":3},null,"Selecionado:",{"$f":"'Dash (2)'!D13","v":"Qual sua avaliação em relação ao prazo de entrega dos produtos?"},null,null,null,null,null,null,null,"Top 5 Maiores Notas",null,null,null,"Top 5 Menores Notas"]
[{"$f":"RESP!B16","v":"Não"},{"$f":"COUNTIF(PESQ!$C$14:$AZ$114,calc!A2)","v":2},null,"Tipo de Resposta:",{"$f":"IFERROR(VLOOKUP(E1,RESP!$F$15:$G$64,2,0),\"\")","v":"Avaliação"},null,null,null,null,null,null,5,{"$f":"IFERROR(LARGE(PESQ!$C$138:$AZ$138,calc!L2),NA())","v":{"$error":"#N/A"}},{"$f":"HLOOKUP(M2,PESQ!$C$138:$AZ$139,2,0)","v":{"$error":"#N/A"}},null,5,{"$f":"IFERROR(SMALL(PESQ!$C$138:$AZ$138,calc!P2),NA())","v":{"$error":"#N/A"}},{"$f":"HLOOKUP(Q2,PESQ!$C$138:$AZ$139,2,0)","v":{"$error":"#N/A"}}]
[null,null,null,null,null,null,null,null,null,null,null,4,{"$f":"IFERROR(LARGE(PESQ!$C$138:$AZ$138,calc!L3),NA())","v":{"$error":"#N/A"}},{"$f":"HLOOKUP(M3,PESQ!$C$138:$AZ$139,2,0)","v":{"$error":"#N/A"}},null,4,{"$f":"IFERROR(SMALL(PESQ!$C$138:$AZ$138,calc!P3),NA())","v":{"$error":"#N/A"}},{"$f":"HLOOKUP(Q3,PESQ!$C$138:$AZ$139,2,0)","v":{"$error":"#N/A"}}]
[{"$f":"RESP!C15","v":"Excelente"},{"$f":"COUNTIF(PESQ!$C$14:$AZ$114,calc!A4)","v":2},null,{"$f":"IF($E$2=\"Binária\",A1,IF($E$2=\"Avaliação\",A4,IF($E$2=\"Qualitativa\",A9,\"\")))","v":"Excelente"},{"$f":"IFERROR(HLOOKUP($E$1,PESQ!C$12:AB$133,F4,0),\"\")","v":2},{"$f":"IF($E$2=\"Binária\",105,IF($E$2=\"Avaliação\",108,IF($E$2=\"Qualitativa\",113,\"\")))","v":108},null,{"$f":"D4","v":"Excelente"},{"$f":"IFERROR(E4/$J$4,\"\")","v":0.4},{"$f":"SUM(E4:E13)","v":5},null,3,{"$f":"IFERROR(LARGE(PESQ!$C$138:$AZ$138,calc!L4),NA())","v":0.46},{"$f":"HLOOKUP(M4,PESQ!$C$138:$AZ$139,2,0)","v":"Qual sua nota referente ao nosso atendimento telefônico?"},null,3,{"$f":"IFERROR(SMALL(PESQ!$C$138:$AZ$138,calc!P4),NA())","v":0.64},{"$f":"HLOOKUP(Q4,PESQ!$C$138:$AZ$139,2,0)","v":"Qual sua avaliação em relação ao prazo de entrega dos produtos?"}]
[{"$f":"RESP!C16","v":"Bom"},{"$f":"COUNTIF(PESQ!$C$14:$AZ$114,calc!A5)","v":1},null,{"$f":"IF($E$2=\"Binária\",A2,IF($E$2=\"Avaliação\",A5,IF($E$2=\"Qualitativa\",A10,\"\")))","v":"Bom"},{"$f":"IFERROR(HLOOKUP($E$1,PESQ!C$12:AB$133,F5,0),\"\")","v":1},{"$f":"IF(D5=\"\",\"\",F4+1)","v":109},null,{"$f":"D5","v":"Bom"},{"$f":"IFERROR(E5/$J$4,\"\")","v":0.2},null,null,2,{"$f":"IFERROR(LARGE(PESQ!$C$138:$AZ$138,calc!L5),NA())","v":0.6},{"$f":"HLOOKUP(M5,PESQ!$C$138:$AZ$139,2,0)","v":"Você indicaria nossos produtos?"},null,2,{"$f":"IFERROR(SMALL(PESQ!$C$138:$AZ$138,calc!P5),NA())","v":0.6},{"$f":"HLOOKUP(Q5,PESQ!$C$138:$AZ$139,2,0)","v":"Você indicaria nossos produtos?"}]
[{"$f":"RESP!C17","v":"Ruim"},{"$f":"COUNTIF(PESQ!$C$14:$AZ$114,calc!A6)","v":1},null,{"$f":"IF($E$2=\"Avaliação\",A6,IF($E$2=\"Qualitativa\",A11,\"\"))","v":"Ruim"},{"$f":"IFERROR(HLOOKUP($E$1,PESQ!C$12:AB$133,F6,0),\"\")","v":1},{"$f":"IF(D6=\"\",\"\",F5+1)","v":110},null,"Ruim",0.2,null,null,1,{"$f":"IFERROR(LARGE(PESQ!$C$138:$AZ$138,calc!L6),NA())","v":0.64},{"$f":"HLOOKUP(M6,PESQ!$C$138:$AZ$139,2,0)","v":"Qual sua avaliação em relação ao prazo de entrega dos produtos?"},null,1,{"$f":"IFERROR(SMALL(PESQ!$C$138:$AZ$138,calc!P6),NA())","v":0.46},{"$f":"HLOOKUP(Q6,PESQ!$C$138:$AZ$139,2,0)","v":"Qual sua nota referente ao nosso atendimento telefônico?"}]
[{"$f":"RESP!C18","v":"Péssimo"},{"$f":"COUNTIF(PESQ!$C$14:$AZ$114,calc!A7)","v":1},null,{"$f":"IF($E$2=\"Avaliação\",A7,IF($E$2=\"Qualitativa\",A12,\"\"))","v":"Péssimo"},{"$f":"IFERROR(HLOOKUP($E$1,PESQ!C$12:AB$133,F7,0),\"\")","v":1},111,null,"Péssimo",0.2]
[null,null,null,{"$f":"IF($E$2=\"Qualitativa\",A13,\"\")","v":""},{"$f":"IFERROR(HLOOKUP($E$1,PESQ!C$12:AB$133,F8,0),\"\")","v":""},"",null,"",""]
[{"$f":"RESP!D15","v":1},{"$f":"COUNTIF(PESQ!$C$14:$AZ$114,calc!A9)","v":0},null,{"$f":"IF($E$2=\"Qualitativa\",A14,\"\")","v":""},{"$f":"IFERROR(HLOOKUP($E$1,PESQ!C$12:AB$133,F9,0),\"\")","v":""},"",null,"",""]
[{"$f":"RESP!D16","v":2},{"$f":"COUNTIF(PESQ!$C$14:$AZ$114,calc!A10)","v":2},null,"",{"$f":"IFERROR(HLOOKUP($E$1,PESQ!C$12:AB$133,F10,0),\"\")","v":""},"",null,"",""]
[{"$f":"RESP!D17","v":3},{"$f":"COUNTIF(PESQ!$C$14:$AZ$114,calc!A11)","v":0},null,"",{"$f":"IFERROR(HLOOKUP($E$1,PESQ!C$12:AB$133,F11,0),\"\")","v":""},"",null,"",""]
[{"$f":"RESP!D18","v":4},{"$f":"COUNTIF(PESQ!$C$14:$AZ$114,calc!A12)","v":1},null,"",{"$f":"IFERROR(HLOOKUP($E$1,PESQ!C$12:AB$133,F12,0),\"\")","v":""},"",null,"",""]
[{"$f":"RESP!D19","v":5},{"$f":"COUNTIF(PESQ!$C$14:$AZ$114,calc!A13)","v":1},null,"",{"$f":"IFERROR(HLOOKUP($E$1,PESQ!C$12:AB$133,F13,0),\"\")","v":""},"",null,"",""]
[{"$f":"RESP!D20","v":6},{"$f":"COUNTIF(PESQ!$C$14:$AZ$114,calc!A14)","v":0}]
[{"$f":"RESP!D21","v":7},{"$f":"COUNTIF(PESQ!$C$14:$AZ$114,calc!A15)","v":0}]
{"$rows_left_out":3}